BDBM50379158 CHEMBL2010837
SMILES: CN(C1CCN(Cc2ccc(cc2)C(F)(F)F)CC1)C(=O)Cc1ccccc1
InChI Key: InChIKey=SBMDSJBGWCTTBK-UHFFFAOYSA-N
Data: 1 IC50  1 EC50
Activity Spreadsheet -- Enzyme Inhibition Constant Data from BindingDB
Found 2 hits for monomerid = 50379158
Trg + Lig
Ki
nM
ΔG°
kcal/mole
IC50
nM
Kd
nM
EC50/IC50
nM
koff
s-1
kon
M-1s-1
pHTemp
°C
Potassium voltage-gated channel subfamily H member 2
(Homo sapiens (Human))
BDBM50379158
(CHEMBL2010837)
Show SMILES CN(C1CCN(Cc2ccc(cc2)C(F)(F)F)CC1)C(=O)Cc1ccccc1
Show InChI InChI=1S/C22H25F3N2O/c1-26(21(28)15-17-5-3-2-4-6-17)20-11-13-27(14-12-20)16-18-7-9-19(10-8-18)22(23,24)25/h2-10,20H,11-16H2,1H3
Reactome pathway
n/an/a 1.60E+3n/an/an/an/an/an/a
Astrazeneca U K Ltd
Curated by ChEMBL
Assay Description
Binding affinity to human ERG
Bioorg Med Chem Lett 21: 7310-6 (2011)
Article DOI: 10.1016/j.bmcl.2011.10.033
BindingDB Entry DOI: 10.7270/Q27945PF
G-protein coupled receptor 119 (GPR119)
(Homo sapiens (Human))
BDBM50379158
(CHEMBL2010837)
Show SMILES CN(C1CCN(Cc2ccc(cc2)C(F)(F)F)CC1)C(=O)Cc1ccccc1
Show InChI InChI=1S/C22H25F3N2O/c1-26(21(28)15-17-5-3-2-4-6-17)20-11-13-27(14-12-20)16-18-7-9-19(10-8-18)22(23,24)25/h2-10,20H,11-16H2,1H3
n/an/an/an/a>3.00E+4n/an/an/an/a
Astrazeneca U K Ltd
Curated by ChEMBL
Assay Description
Agonist activity at human GPR119 receptor expressed in HEK293 cells assessed as cAMP accumulation after 45 mins by fluorescence assay
Bioorg Med Chem Lett 21: 7310-6 (2011)
Article DOI: 10.1016/j.bmcl.2011.10.033
BindingDB Entry DOI: 10.7270/Q27945PF