null
SMILES: CO[C@H]1CN(Cc2ccc(cc2)C(F)(F)F)CC[C@H]1N(C)C(=O)Cc1ccc(cc1)-n1cnnn1
InChI Key: InChIKey=MTJFPNPDPMDLQJ-YADHBBJMSA-N
Activity Spreadsheet -- Enzyme Inhibition Constant Data from BindingDB
Found 2 hits for monomerid = 50379165
Trg + Lig
Ki
nM
ΔG°
kcal/mole
IC50
nM
Kd
nM
EC50/IC50
nM
koff
s-1
kon
M-1s-1
pHTemp
°C
Potassium voltage-gated channel subfamily H member 2
(Homo sapiens (Human))
BDBM50379165
(CHEMBL2010847)
Show SMILES CO[C@H]1CN(Cc2ccc(cc2)C(F)(F)F)CC[C@H]1N(C)C(=O)Cc1ccc(cc1)-n1cnnn1 |r|
Show InChI InChI=1S/C24H27F3N6O2/c1-31(23(34)13-17-5-9-20(10-6-17)33-16-28-29-30-33)21-11-12-32(15-22(21)35-2)14-18-3-7-19(8-4-18)24(25,26)27/h3-10,16,21-22H,11-15H2,1-2H3/t21-,22+/m1/s1
Reactome pathway
n/an/a 1.20E+3n/an/an/an/an/an/a
Astrazeneca U K Ltd
Curated by ChEMBL
Assay Description
Binding affinity to human ERG
Bioorg Med Chem Lett 21: 7310-6 (2011)
Article DOI: 10.1016/j.bmcl.2011.10.033
BindingDB Entry DOI: 10.7270/Q27945PF
Glucose-dependent insulinotropic receptor
(Homo sapiens (Human))
BDBM50379165
(CHEMBL2010847)
Show SMILES CO[C@H]1CN(Cc2ccc(cc2)C(F)(F)F)CC[C@H]1N(C)C(=O)Cc1ccc(cc1)-n1cnnn1 |r|
Show InChI InChI=1S/C24H27F3N6O2/c1-31(23(34)13-17-5-9-20(10-6-17)33-16-28-29-30-33)21-11-12-32(15-22(21)35-2)14-18-3-7-19(8-4-18)24(25,26)27/h3-10,16,21-22H,11-15H2,1-2H3/t21-,22+/m1/s1
n/an/an/an/a 172n/an/an/an/a
Astrazeneca U K Ltd
Curated by ChEMBL
Assay Description
Agonist activity at human GPR119 receptor expressed in HEK293 cells assessed as cAMP accumulation after 45 mins by fluorescence assay
Bioorg Med Chem Lett 21: 7310-6 (2011)
Article DOI: 10.1016/j.bmcl.2011.10.033
BindingDB Entry DOI: 10.7270/Q27945PF