BDBM50379174 CHEMBL2010838
SMILES: CN(C1CCN(Cc2ccc(cn2)C(F)(F)F)CC1)C(=O)Cc1ccc(cc1)-n1cnnn1
InChI Key: InChIKey=RNCKTWHQXIORDB-UHFFFAOYSA-N
Data: 1 IC50  1 EC50
Activity Spreadsheet -- Enzyme Inhibition Constant Data from BindingDB
Found 2 hits for monomerid = 50379174
Trg + Lig
Ki
nM
ΔG°
kcal/mole
IC50
nM
Kd
nM
EC50/IC50
nM
koff
s-1
kon
M-1s-1
pHTemp
°C
Potassium voltage-gated channel subfamily H member 2
(Homo sapiens (Human))
BDBM50379174
(CHEMBL2010838)
Show SMILES CN(C1CCN(Cc2ccc(cn2)C(F)(F)F)CC1)C(=O)Cc1ccc(cc1)-n1cnnn1
Show InChI InChI=1S/C22H24F3N7O/c1-30(21(33)12-16-2-6-20(7-3-16)32-15-27-28-29-32)19-8-10-31(11-9-19)14-18-5-4-17(13-26-18)22(23,24)25/h2-7,13,15,19H,8-12,14H2,1H3
Reactome pathway
n/an/a 4.20E+3n/an/an/an/an/an/a
Astrazeneca U K Ltd
Curated by ChEMBL
Assay Description
Binding affinity to human ERG
Bioorg Med Chem Lett 21: 7310-6 (2011)
Article DOI: 10.1016/j.bmcl.2011.10.033
BindingDB Entry DOI: 10.7270/Q27945PF
G-protein coupled receptor 119 (GPR119)
(Homo sapiens (Human))
BDBM50379174
(CHEMBL2010838)
Show SMILES CN(C1CCN(Cc2ccc(cn2)C(F)(F)F)CC1)C(=O)Cc1ccc(cc1)-n1cnnn1
Show InChI InChI=1S/C22H24F3N7O/c1-30(21(33)12-16-2-6-20(7-3-16)32-15-27-28-29-32)19-8-10-31(11-9-19)14-18-5-4-17(13-26-18)22(23,24)25/h2-7,13,15,19H,8-12,14H2,1H3
n/an/an/an/a 1.35E+3n/an/an/an/a
Astrazeneca U K Ltd
Curated by ChEMBL
Assay Description
Agonist activity at human GPR119 receptor expressed in HEK293 cells assessed as cAMP accumulation after 45 mins by fluorescence assay
Bioorg Med Chem Lett 21: 7310-6 (2011)
Article DOI: 10.1016/j.bmcl.2011.10.033
BindingDB Entry DOI: 10.7270/Q27945PF