BDBM50379181 CHEMBL2010830
SMILES: CCN(C1CCN(Cc2ccc(cc2)C(F)(F)F)CC1)C(=O)Cc1ccc(cc1)S(C)(=O)=O
InChI Key: InChIKey=AFJBIEFMCXULHJ-UHFFFAOYSA-N
Data: 1 IC50  1 EC50
Activity Spreadsheet -- Enzyme Inhibition Constant Data from BindingDB
Found 2 hits for monomerid = 50379181
Trg + Lig
Ki
nM
ΔG°
kcal/mole
IC50
nM
Kd
nM
EC50/IC50
nM
koff
s-1
kon
M-1s-1
pHTemp
°C
Potassium voltage-gated channel subfamily H member 2
(Homo sapiens (Human))
BDBM50379181
(CHEMBL2010830)
Show SMILES CCN(C1CCN(Cc2ccc(cc2)C(F)(F)F)CC1)C(=O)Cc1ccc(cc1)S(C)(=O)=O
Show InChI InChI=1S/C24H29F3N2O3S/c1-3-29(23(30)16-18-6-10-22(11-7-18)33(2,31)32)21-12-14-28(15-13-21)17-19-4-8-20(9-5-19)24(25,26)27/h4-11,21H,3,12-17H2,1-2H3
Reactome pathway
n/an/a 2.50E+3n/an/an/an/an/an/a
Astrazeneca U K Ltd
Curated by ChEMBL
Assay Description
Binding affinity to human ERG
Bioorg Med Chem Lett 21: 7310-6 (2011)
Article DOI: 10.1016/j.bmcl.2011.10.033
BindingDB Entry DOI: 10.7270/Q27945PF
Glucose-dependent insulinotropic receptor
(Homo sapiens (Human))
BDBM50379181
(CHEMBL2010830)
Show SMILES CCN(C1CCN(Cc2ccc(cc2)C(F)(F)F)CC1)C(=O)Cc1ccc(cc1)S(C)(=O)=O
Show InChI InChI=1S/C24H29F3N2O3S/c1-3-29(23(30)16-18-6-10-22(11-7-18)33(2,31)32)21-12-14-28(15-13-21)17-19-4-8-20(9-5-19)24(25,26)27/h4-11,21H,3,12-17H2,1-2H3
n/an/an/an/a 538n/an/an/an/a
Astrazeneca U K Ltd
Curated by ChEMBL
Assay Description
Agonist activity at human GPR119 receptor expressed in HEK293 cells assessed as cAMP accumulation after 45 mins by fluorescence assay
Bioorg Med Chem Lett 21: 7310-6 (2011)
Article DOI: 10.1016/j.bmcl.2011.10.033
BindingDB Entry DOI: 10.7270/Q27945PF