BDBM50379188 CHEMBL2010876
SMILES: CC(C)Cn1c2ccc(Nc3nccc(n3)C(F)(F)F)cc2c2c3CNC(=O)c3c3-c4cn(C)nc4CCc3c12
InChI Key: InChIKey=MHDAGXYQIWJNMU-UHFFFAOYSA-N
Data: 2 IC50
Activity Spreadsheet -- Enzyme Inhibition Constant Data from BindingDB
Found 2 hits for monomerid = 50379188
Trg + Lig
Ki
nM
ΔG°
kcal/mole
IC50
nM
Kd
nM
EC50/IC50
nM
koff
s-1
kon
M-1s-1
pHTemp
°C
Vascular endothelial growth factor receptor 2
(Homo sapiens (Human))
BDBM50379188
(CHEMBL2010876)
Show SMILES CC(C)Cn1c2ccc(Nc3nccc(n3)C(F)(F)F)cc2c2c3CNC(=O)c3c3-c4cn(C)nc4CCc3c12
Show InChI InChI=1S/C29H26F3N7O/c1-14(2)12-39-21-7-4-15(35-28-33-9-8-22(36-28)29(30,31)32)10-17(21)24-18-11-34-27(40)25(18)23-16(26(24)39)5-6-20-19(23)13-38(3)37-20/h4,7-10,13-14H,5-6,11-12H2,1-3H3,(H,34,40)(H,33,35,36)
NCI pathway
Reactome pathway
n/an/a 271n/an/an/an/an/an/a
Cephalon, Inc.
Curated by ChEMBL
Assay Description
Inhibition of human recombinant VEGF-R2 expressed in baculovirus expression system using GST-PLCgamma as substrate after 1 hr by time-resolved fluore...
J Med Chem 55: 903-13 (2012)
Article DOI: 10.1021/jm201449n
BindingDB Entry DOI: 10.7270/Q2ZS2XHW
Angiopoietin-1 receptor
(Homo sapiens (Human))
BDBM50379188
(CHEMBL2010876)
Show SMILES CC(C)Cn1c2ccc(Nc3nccc(n3)C(F)(F)F)cc2c2c3CNC(=O)c3c3-c4cn(C)nc4CCc3c12
Show InChI InChI=1S/C29H26F3N7O/c1-14(2)12-39-21-7-4-15(35-28-33-9-8-22(36-28)29(30,31)32)10-17(21)24-18-11-34-27(40)25(18)23-16(26(24)39)5-6-20-19(23)13-38(3)37-20/h4,7-10,13-14H,5-6,11-12H2,1-3H3,(H,34,40)(H,33,35,36)
n/an/a>3.00E+3n/an/an/an/an/an/a
Cephalon, Inc.
Curated by ChEMBL
Assay Description
Inhibition of human recombinant Tie2 expressed in baculovirus expression system using GST-PLCgamma as substrate after 1 hr by time-resolved fluoresce...
J Med Chem 55: 903-13 (2012)
Article DOI: 10.1021/jm201449n
BindingDB Entry DOI: 10.7270/Q2ZS2XHW