BDBM50379192 CHEMBL2010877
SMILES: CC(C)n1c2ccc(Nc3cccnn3)cc2c2c3CNC(=O)c3c3-c4cn(C)nc4CCc3c12
InChI Key: InChIKey=IBBWUKPTAXNFEO-UHFFFAOYSA-N
Data: 2 IC50
Activity Spreadsheet -- Enzyme Inhibition Constant Data from BindingDB
Found 2 hits for monomerid = 50379192
Trg + Lig
Ki
nM
ΔG°
kcal/mole
IC50
nM
Kd
nM
EC50/IC50
nM
koff
s-1
kon
M-1s-1
pHTemp
°C
Vascular endothelial growth factor receptor 2
(Homo sapiens (Human))
BDBM50379192
(CHEMBL2010877)
Show SMILES CC(C)n1c2ccc(Nc3cccnn3)cc2c2c3CNC(=O)c3c3-c4cn(C)nc4CCc3c12
Show InChI InChI=1S/C27H25N7O/c1-14(2)34-21-9-6-15(30-22-5-4-10-29-31-22)11-17(21)24-18-12-28-27(35)25(18)23-16(26(24)34)7-8-20-19(23)13-33(3)32-20/h4-6,9-11,13-14H,7-8,12H2,1-3H3,(H,28,35)(H,30,31)
NCI pathway
Reactome pathway
n/an/a 10n/an/an/an/an/an/a
Cephalon, Inc.
Curated by ChEMBL
Assay Description
Inhibition of human recombinant VEGF-R2 expressed in baculovirus expression system using GST-PLCgamma as substrate after 1 hr by time-resolved fluore...
J Med Chem 55: 903-13 (2012)
Article DOI: 10.1021/jm201449n
BindingDB Entry DOI: 10.7270/Q2ZS2XHW
Angiopoietin-1 receptor
(Homo sapiens (Human))
BDBM50379192
(CHEMBL2010877)
Show SMILES CC(C)n1c2ccc(Nc3cccnn3)cc2c2c3CNC(=O)c3c3-c4cn(C)nc4CCc3c12
Show InChI InChI=1S/C27H25N7O/c1-14(2)34-21-9-6-15(30-22-5-4-10-29-31-22)11-17(21)24-18-12-28-27(35)25(18)23-16(26(24)34)7-8-20-19(23)13-33(3)32-20/h4-6,9-11,13-14H,7-8,12H2,1-3H3,(H,28,35)(H,30,31)
n/an/a 166n/an/an/an/an/an/a
Cephalon, Inc.
Curated by ChEMBL
Assay Description
Inhibition of human recombinant Tie2 expressed in baculovirus expression system using GST-PLCgamma as substrate after 1 hr by time-resolved fluoresce...
J Med Chem 55: 903-13 (2012)
Article DOI: 10.1021/jm201449n
BindingDB Entry DOI: 10.7270/Q2ZS2XHW