BDBM50379277 CHEMBL90825
SMILES: CCCCN(Cc1ccc(cc1)-c1ccccc1-c1nnn[nH]1)c1nc(C)cc(C)n1
InChI Key: InChIKey=ZSQBWJVNWXAGKO-UHFFFAOYSA-N
Data: 1 IC50  1 Kd
Activity Spreadsheet -- Enzyme Inhibition Constant Data from BindingDB
Found 2 hits for monomerid = 50379277
Trg + Lig
Ki
nM
ΔG°
kcal/mole
IC50
nM
Kd
nM
EC50/IC50
nM
koff
s-1
kon
M-1s-1
pHTemp
°C
Mitogen-activated protein kinase 8
(Homo sapiens (Human))
BDBM50379277
(CHEMBL90825)
Show SMILES CCCCN(Cc1ccc(cc1)-c1ccccc1-c1nnn[nH]1)c1nc(C)cc(C)n1
Show InChI InChI=1S/C24H27N7/c1-4-5-14-31(24-25-17(2)15-18(3)26-24)16-19-10-12-20(13-11-19)21-8-6-7-9-22(21)23-27-29-30-28-23/h6-13,15H,4-5,14,16H2,1-3H3,(H,27,28,29,30)
NCI pathway
Reactome pathway
n/an/a 7.70E+3n/an/an/an/an/an/a
University of California
Curated by ChEMBL
Assay Description
Inhibition of C-terminal His6-tagged human JNK1alpha1 (1 to 364 residues) expressed in Escherichia coli BL21(DE3) cells assessed as reduction in MKK7...
J Med Chem 62: 6512-6524 (2019)
Article DOI: 10.1021/acs.jmedchem.9b00089
Mitogen-activated protein kinase 8
(Homo sapiens (Human))
BDBM50379277
(CHEMBL90825)
Show SMILES CCCCN(Cc1ccc(cc1)-c1ccccc1-c1nnn[nH]1)c1nc(C)cc(C)n1
Show InChI InChI=1S/C24H27N7/c1-4-5-14-31(24-25-17(2)15-18(3)26-24)16-19-10-12-20(13-11-19)21-8-6-7-9-22(21)23-27-29-30-28-23/h6-13,15H,4-5,14,16H2,1-3H3,(H,27,28,29,30)
NCI pathway
Reactome pathway
n/an/an/a 1.60E+4n/an/an/an/an/a
Broad Institute of Harvard and MIT
Curated by ChEMBL
Assay Description
Binding affinity to JNK1 allosteric site by AS-MS analysis
Bioorg Med Chem 20: 1979-89 (2012)
Article DOI: 10.1016/j.bmc.2011.11.071
BindingDB Entry DOI: 10.7270/Q22J6CVS