null
SMILES: CN(c1ccc(Cl)cc1)c1ccc(Nc2nccc(N)n2)cc1
InChI Key: InChIKey=WVWFBDNEALDWKB-UHFFFAOYSA-N
Activity Spreadsheet -- Enzyme Inhibition Constant Data from BindingDB
Found 3 hits for monomerid = 50379410
Trg + Lig
Ki
nM
ΔG°
kcal/mole
IC50
nM
Kd
nM
EC50/IC50
nM
koff
s-1
kon
M-1s-1
pHTemp
°C
Potassium voltage-gated channel subfamily H member 2
(Homo sapiens (Human))
BDBM50379410
(CHEMBL2012023)
Show SMILES CN(c1ccc(Cl)cc1)c1ccc(Nc2nccc(N)n2)cc1
Show InChI InChI=1S/C17H16ClN5/c1-23(14-6-2-12(18)3-7-14)15-8-4-13(5-9-15)21-17-20-11-10-16(19)22-17/h2-11H,1H3,(H3,19,20,21,22)
Reactome pathway
800n/an/an/an/an/an/an/an/a
Amgen Inc.
Curated by ChEMBL
Assay Description
Displacement of dofetilide from human ERG
Bioorg Med Chem Lett 22: 2033-42 (2012)
Article DOI: 10.1016/j.bmcl.2012.01.023
BindingDB Entry DOI: 10.7270/Q2S183H3
Sodium channel protein type 5 subunit alpha
(Homo sapiens (Human))
BDBM50379410
(CHEMBL2012023)
Show SMILES CN(c1ccc(Cl)cc1)c1ccc(Nc2nccc(N)n2)cc1
Show InChI InChI=1S/C17H16ClN5/c1-23(14-6-2-12(18)3-7-14)15-8-4-13(5-9-15)21-17-20-11-10-16(19)22-17/h2-11H,1H3,(H3,19,20,21,22)
n/an/a 3.70E+3n/an/an/an/an/an/a
Amgen Inc.
Curated by ChEMBL
Assay Description
Antagonist activity at human partially inactivated NaV 1.5 channel expressed in HEK293 cells by PatchXpress voltage patch clamp assay
Bioorg Med Chem Lett 22: 2033-42 (2012)
Article DOI: 10.1016/j.bmcl.2012.01.023
BindingDB Entry DOI: 10.7270/Q2S183H3
Sodium channel protein type 9 subunit alpha
(Homo sapiens (Human))
BDBM50379410
(CHEMBL2012023)
Show SMILES CN(c1ccc(Cl)cc1)c1ccc(Nc2nccc(N)n2)cc1
Show InChI InChI=1S/C17H16ClN5/c1-23(14-6-2-12(18)3-7-14)15-8-4-13(5-9-15)21-17-20-11-10-16(19)22-17/h2-11H,1H3,(H3,19,20,21,22)
n/an/a 1.80E+3n/an/an/an/an/an/a
Amgen Inc.
Curated by ChEMBL
Assay Description
Antagonist activity at human partially inactivated NaV 1.7 channel expressed in HEK293 cells by PatchXpress voltage patch clamp assay
Bioorg Med Chem Lett 22: 2033-42 (2012)
Article DOI: 10.1016/j.bmcl.2012.01.023
BindingDB Entry DOI: 10.7270/Q2S183H3