null
SMILES: FC(F)(F)c1ccccc1Cn1ccc2c(OC3CCN(Cc4cscn4)CC3)ncnc12
InChI Key: InChIKey=UMLBPTKZCLVUIO-UHFFFAOYSA-N
Activity Spreadsheet -- Enzyme Inhibition Constant Data from BindingDB
Found 3 hits for monomerid = 50379454
Trg + Lig
Ki
nM
ΔG°
kcal/mole
IC50
nM
Kd
nM
EC50/IC50
nM
koff
s-1
kon
M-1s-1
pHTemp
°C
Potassium voltage-gated channel subfamily H member 2
(Homo sapiens (Human))
BDBM50379454
(CHEMBL2012268)
Show SMILES FC(F)(F)c1ccccc1Cn1ccc2c(OC3CCN(Cc4cscn4)CC3)ncnc12
Show InChI InChI=1S/C23H22F3N5OS/c24-23(25,26)20-4-2-1-3-16(20)11-31-10-7-19-21(31)27-14-28-22(19)32-18-5-8-30(9-6-18)12-17-13-33-15-29-17/h1-4,7,10,13-15,18H,5-6,8-9,11-12H2
Reactome pathway
2.46E+3n/an/an/an/an/an/an/an/a
Amgen Inc.
Curated by ChEMBL
Assay Description
Displacement of dofetilide from human ERG
Bioorg Med Chem Lett 22: 2052-62 (2012)
Article DOI: 10.1016/j.bmcl.2012.01.015
BindingDB Entry DOI: 10.7270/Q2HM59GC
Sodium channel protein type 9 subunit alpha
(Homo sapiens (Human))
BDBM50379454
(CHEMBL2012268)
Show SMILES FC(F)(F)c1ccccc1Cn1ccc2c(OC3CCN(Cc4cscn4)CC3)ncnc12
Show InChI InChI=1S/C23H22F3N5OS/c24-23(25,26)20-4-2-1-3-16(20)11-31-10-7-19-21(31)27-14-28-22(19)32-18-5-8-30(9-6-18)12-17-13-33-15-29-17/h1-4,7,10,13-15,18H,5-6,8-9,11-12H2
n/an/a 80n/an/an/an/an/an/a
Amgen Inc.
Curated by ChEMBL
Assay Description
Antagonist activity at human NaV1.7 channel by patchXpress assay
Bioorg Med Chem Lett 22: 2052-62 (2012)
Article DOI: 10.1016/j.bmcl.2012.01.015
BindingDB Entry DOI: 10.7270/Q2HM59GC
Sodium channel protein type 5 subunit alpha
(Homo sapiens (Human))
BDBM50379454
(CHEMBL2012268)
Show SMILES FC(F)(F)c1ccccc1Cn1ccc2c(OC3CCN(Cc4cscn4)CC3)ncnc12
Show InChI InChI=1S/C23H22F3N5OS/c24-23(25,26)20-4-2-1-3-16(20)11-31-10-7-19-21(31)27-14-28-22(19)32-18-5-8-30(9-6-18)12-17-13-33-15-29-17/h1-4,7,10,13-15,18H,5-6,8-9,11-12H2
n/an/a 120n/an/an/an/an/an/a
Amgen Inc.
Curated by ChEMBL
Assay Description
Antagonist activity at human NaV1.5 channel by patchXpress assay
Bioorg Med Chem Lett 22: 2052-62 (2012)
Article DOI: 10.1016/j.bmcl.2012.01.015
BindingDB Entry DOI: 10.7270/Q2HM59GC