null
SMILES: Fc1cccc(Cn2ccc3c(OC4CCN(Cc5cscn5)CC4)ncnc23)c1F
InChI Key: InChIKey=NGNSDMCZYBVHJY-UHFFFAOYSA-N
Activity Spreadsheet -- Enzyme Inhibition Constant Data from BindingDB
Found 3 hits for monomerid = 50379456
Trg + Lig
Ki
nM
ΔG°
kcal/mole
IC50
nM
Kd
nM
EC50/IC50
nM
koff
s-1
kon
M-1s-1
pHTemp
°C
Potassium voltage-gated channel subfamily H member 2
(Homo sapiens (Human))
BDBM50379456
(CHEMBL2012271)
Show SMILES Fc1cccc(Cn2ccc3c(OC4CCN(Cc5cscn5)CC4)ncnc23)c1F
Show InChI InChI=1S/C22H21F2N5OS/c23-19-3-1-2-15(20(19)24)10-29-9-6-18-21(29)25-13-26-22(18)30-17-4-7-28(8-5-17)11-16-12-31-14-27-16/h1-3,6,9,12-14,17H,4-5,7-8,10-11H2
Reactome pathway
2.30E+3n/an/an/an/an/an/an/an/a
Amgen Inc.
Curated by ChEMBL
Assay Description
Displacement of dofetilide from human ERG
Bioorg Med Chem Lett 22: 2052-62 (2012)
Article DOI: 10.1016/j.bmcl.2012.01.015
BindingDB Entry DOI: 10.7270/Q2HM59GC
Sodium channel protein type 9 subunit alpha
(Homo sapiens (Human))
BDBM50379456
(CHEMBL2012271)
Show SMILES Fc1cccc(Cn2ccc3c(OC4CCN(Cc5cscn5)CC4)ncnc23)c1F
Show InChI InChI=1S/C22H21F2N5OS/c23-19-3-1-2-15(20(19)24)10-29-9-6-18-21(29)25-13-26-22(18)30-17-4-7-28(8-5-17)11-16-12-31-14-27-16/h1-3,6,9,12-14,17H,4-5,7-8,10-11H2
n/an/a 20n/an/an/an/an/an/a
Amgen Inc.
Curated by ChEMBL
Assay Description
Antagonist activity at human NaV1.7 channel by patchXpress assay
Bioorg Med Chem Lett 22: 2052-62 (2012)
Article DOI: 10.1016/j.bmcl.2012.01.015
BindingDB Entry DOI: 10.7270/Q2HM59GC
Sodium channel protein type 5 subunit alpha
(Homo sapiens (Human))
BDBM50379456
(CHEMBL2012271)
Show SMILES Fc1cccc(Cn2ccc3c(OC4CCN(Cc5cscn5)CC4)ncnc23)c1F
Show InChI InChI=1S/C22H21F2N5OS/c23-19-3-1-2-15(20(19)24)10-29-9-6-18-21(29)25-13-26-22(18)30-17-4-7-28(8-5-17)11-16-12-31-14-27-16/h1-3,6,9,12-14,17H,4-5,7-8,10-11H2
n/an/a 70n/an/an/an/an/an/a
Amgen Inc.
Curated by ChEMBL
Assay Description
Antagonist activity at human NaV1.5 channel by patchXpress assay
Bioorg Med Chem Lett 22: 2052-62 (2012)
Article DOI: 10.1016/j.bmcl.2012.01.015
BindingDB Entry DOI: 10.7270/Q2HM59GC