null
SMILES: COCc1cc2n[nH]c(=O)n2c2cc(ccc12)-c1ccsc1
InChI Key: InChIKey=PYCPFPFXNXEALS-UHFFFAOYSA-N
Activity Spreadsheet -- Enzyme Inhibition Constant Data from BindingDB
Found 1 hit for monomerid = 50379546
Trg + Lig
Ki
nM
ΔG°
kcal/mole
IC50
nM
Kd
nM
EC50/IC50
nM
koff
s-1
kon
M-1s-1
pHTemp
°C
Serine/threonine-protein kinase Chk1
(Homo sapiens (Human))
BDBM50379546
(CHEMBL2012879)
Show SMILES COCc1cc2n[nH]c(=O)n2c2cc(ccc12)-c1ccsc1
Show InChI InChI=1S/C16H13N3O2S/c1-21-8-12-7-15-17-18-16(20)19(15)14-6-10(2-3-13(12)14)11-4-5-22-9-11/h2-7,9H,8H2,1H3,(H,18,20)
Reactome pathway
n/an/a 3n/an/an/an/an/an/a
AstraZeneca R&D Boston
Curated by ChEMBL
Assay Description
Inhibition of Chk1
Bioorg Med Chem Lett 22: 2330-7 (2012)
Article DOI: 10.1016/j.bmcl.2012.01.043
BindingDB Entry DOI: 10.7270/Q2GM88B0