BDBM50379629 CHEMBL2013062
SMILES: C1CN(CCN1)c1ccnc(Nc2ncc(s2)-c2cncnc2)c1
InChI Key: InChIKey=MARUNRKQKNXGKR-UHFFFAOYSA-N
Data: 2 IC50
Activity Spreadsheet -- Enzyme Inhibition Constant Data from BindingDB
Found 2 hits for monomerid = 50379629
Trg + Lig
Ki
nM
ΔG°
kcal/mole
IC50
nM
Kd
nM
EC50/IC50
nM
koff
s-1
kon
M-1s-1
pHTemp
°C
Cyclin-dependent kinase 7
(Homo sapiens (Human))
BDBM50379629
(CHEMBL2013062)
Show SMILES C1CN(CCN1)c1ccnc(Nc2ncc(s2)-c2cncnc2)c1
Show InChI InChI=1S/C16H17N7S/c1-2-20-15(7-13(1)23-5-3-17-4-6-23)22-16-21-10-14(24-16)12-8-18-11-19-9-12/h1-2,7-11,17H,3-6H2,(H,20,21,22)
NCI pathway
Reactome pathway
n/an/a 1.10E+4n/an/an/an/an/an/a
Merck Research Laboratories
Curated by ChEMBL
Assay Description
Inhibition of CDK7
Bioorg Med Chem Lett 22: 2613-9 (2012)
Article DOI: 10.1016/j.bmcl.2012.01.120
BindingDB Entry DOI: 10.7270/Q23B615X
Serine/threonine-protein kinase Chk1
(Homo sapiens (Human))
BDBM50379629
(CHEMBL2013062)
Show SMILES C1CN(CCN1)c1ccnc(Nc2ncc(s2)-c2cncnc2)c1
Show InChI InChI=1S/C16H17N7S/c1-2-20-15(7-13(1)23-5-3-17-4-6-23)22-16-21-10-14(24-16)12-8-18-11-19-9-12/h1-2,7-11,17H,3-6H2,(H,20,21,22)
Reactome pathway
n/an/a 29n/an/an/an/an/an/a
Merck Research Laboratories
Curated by ChEMBL
Assay Description
Inhibition of CHK1 by time resolved fluorescence assay
Bioorg Med Chem Lett 22: 2613-9 (2012)
Article DOI: 10.1016/j.bmcl.2012.01.120
BindingDB Entry DOI: 10.7270/Q23B615X
3D
3D Structure (docked)