null
SMILES: NCCCCc1cncc(c1)-c1cnc(Nc2cc(ccn2)N2CCOCC2)s1
InChI Key: InChIKey=FLWOVCZKXXWOJC-UHFFFAOYSA-N
Activity Spreadsheet -- Enzyme Inhibition Constant Data from BindingDB
Found 2 hits for monomerid = 50379647
Trg + Lig
Ki
nM
ΔG°
kcal/mole
IC50
nM
Kd
nM
EC50/IC50
nM
koff
s-1
kon
M-1s-1
pHTemp
°C
Cyclin-dependent kinase 7
(Homo sapiens (Human))
BDBM50379647
(CHEMBL2013164)
Show SMILES NCCCCc1cncc(c1)-c1cnc(Nc2cc(ccn2)N2CCOCC2)s1
Show InChI InChI=1S/C21H26N6OS/c22-5-2-1-3-16-11-17(14-23-13-16)19-15-25-21(29-19)26-20-12-18(4-6-24-20)27-7-9-28-10-8-27/h4,6,11-15H,1-3,5,7-10,22H2,(H,24,25,26)
NCI pathway
Reactome pathway
n/an/a>1.00E+4n/an/an/an/an/an/a
Merck Research Laboratories
Curated by ChEMBL
Assay Description
Inhibition of CDK7
Bioorg Med Chem Lett 22: 2613-9 (2012)
Article DOI: 10.1016/j.bmcl.2012.01.120
BindingDB Entry DOI: 10.7270/Q23B615X
Serine/threonine-protein kinase Chk1
(Homo sapiens (Human))
BDBM50379647
(CHEMBL2013164)
Show SMILES NCCCCc1cncc(c1)-c1cnc(Nc2cc(ccn2)N2CCOCC2)s1
Show InChI InChI=1S/C21H26N6OS/c22-5-2-1-3-16-11-17(14-23-13-16)19-15-25-21(29-19)26-20-12-18(4-6-24-20)27-7-9-28-10-8-27/h4,6,11-15H,1-3,5,7-10,22H2,(H,24,25,26)
Reactome pathway
n/an/a 12n/an/an/an/an/an/a
Merck Research Laboratories
Curated by ChEMBL
Assay Description
Inhibition of CHK1 by time resolved fluorescence assay
Bioorg Med Chem Lett 22: 2613-9 (2012)
Article DOI: 10.1016/j.bmcl.2012.01.120
BindingDB Entry DOI: 10.7270/Q23B615X