null
SMILES: NCNC(=O)c1cncc(c1)-c1cnc(Nc2cc(ccn2)N2CCC(F)(F)CC2)s1
InChI Key: InChIKey=JCSHLEDYODZCMJ-UHFFFAOYSA-N
Activity Spreadsheet -- Enzyme Inhibition Constant Data from BindingDB
Found 2 hits for monomerid = 50379652
Trg + Lig
Ki
nM
ΔG°
kcal/mole
IC50
nM
Kd
nM
EC50/IC50
nM
koff
s-1
kon
M-1s-1
pHTemp
°C
Cyclin-dependent kinase 7
(Homo sapiens (Human))
BDBM50379652
(CHEMBL2013170)
Show SMILES NCNC(=O)c1cncc(c1)-c1cnc(Nc2cc(ccn2)N2CCC(F)(F)CC2)s1
Show InChI InChI=1S/C20H21F2N7OS/c21-20(22)2-5-29(6-3-20)15-1-4-25-17(8-15)28-19-26-11-16(31-19)13-7-14(10-24-9-13)18(30)27-12-23/h1,4,7-11H,2-3,5-6,12,23H2,(H,27,30)(H,25,26,28)
NCI pathway
Reactome pathway
n/an/a 317n/an/an/an/an/an/a
Merck Research Laboratories
Curated by ChEMBL
Assay Description
Inhibition of CDK7
Bioorg Med Chem Lett 22: 2613-9 (2012)
Article DOI: 10.1016/j.bmcl.2012.01.120
BindingDB Entry DOI: 10.7270/Q23B615X
Serine/threonine-protein kinase Chk1
(Homo sapiens (Human))
BDBM50379652
(CHEMBL2013170)
Show SMILES NCNC(=O)c1cncc(c1)-c1cnc(Nc2cc(ccn2)N2CCC(F)(F)CC2)s1
Show InChI InChI=1S/C20H21F2N7OS/c21-20(22)2-5-29(6-3-20)15-1-4-25-17(8-15)28-19-26-11-16(31-19)13-7-14(10-24-9-13)18(30)27-12-23/h1,4,7-11H,2-3,5-6,12,23H2,(H,27,30)(H,25,26,28)
Reactome pathway
n/an/a 0.0500n/an/an/an/an/an/a
Merck Research Laboratories
Curated by ChEMBL
Assay Description
Inhibition of CHK1 by time resolved fluorescence assay
Bioorg Med Chem Lett 22: 2613-9 (2012)
Article DOI: 10.1016/j.bmcl.2012.01.120
BindingDB Entry DOI: 10.7270/Q23B615X