BDBM50379744 CHEMBL2011136
SMILES: CN1CCC(C1)N1CCCCc2cc(ccc12)N=C(N)c1cccs1
InChI Key: InChIKey=CCQPLHUSAUKMET-UHFFFAOYSA-N
Data: 3 IC50
Activity Spreadsheet -- Enzyme Inhibition Constant Data from BindingDB
Found 3 hits for monomerid = 50379744
Trg + Lig
Ki
nM
ΔG°
kcal/mole
IC50
nM
Kd
nM
EC50/IC50
nM
koff
s-1
kon
M-1s-1
pHTemp
°C
Nitric oxide synthase, brain
(Homo sapiens (Human))
BDBM50379744
(CHEMBL2011136)
Show SMILES CN1CCC(C1)N1CCCCc2cc(ccc12)N=C(N)c1cccs1 |w:17.19|
Show InChI InChI=1S/C20H26N4S/c1-23-11-9-17(14-23)24-10-3-2-5-15-13-16(7-8-18(15)24)22-20(21)19-6-4-12-25-19/h4,6-8,12-13,17H,2-3,5,9-11,14H2,1H3,(H2,21,22)
Reactome pathway
n/an/a 80n/an/an/an/an/an/a
NeurAxon Inc.
Curated by ChEMBL
Assay Description
Inhibition of human recombinant nNOS expressed in baculovirus infected insect sf9 cells assessed as conversion of [3H]-L-arginine into [3H]-L-citrull...
Bioorg Med Chem Lett 22: 2510-3 (2012)
Article DOI: 10.1016/j.bmcl.2012.02.004
BindingDB Entry DOI: 10.7270/Q2639QRG
Nitric oxide synthase, inducible
(Homo sapiens (Human))
BDBM50379744
(CHEMBL2011136)
Show SMILES CN1CCC(C1)N1CCCCc2cc(ccc12)N=C(N)c1cccs1 |w:17.19|
Show InChI InChI=1S/C20H26N4S/c1-23-11-9-17(14-23)24-10-3-2-5-15-13-16(7-8-18(15)24)22-20(21)19-6-4-12-25-19/h4,6-8,12-13,17H,2-3,5,9-11,14H2,1H3,(H2,21,22)
NCI pathway
Reactome pathway
n/an/a>1.00E+5n/an/an/an/an/an/a
NeurAxon Inc.
Curated by ChEMBL
Assay Description
Inhibition of human recombinant iNOS expressed in baculovirus infected insect sf9 cells assessed as conversion of [3H]-L-arginine into [3H]-L-citrull...
Bioorg Med Chem Lett 22: 2510-3 (2012)
Article DOI: 10.1016/j.bmcl.2012.02.004
BindingDB Entry DOI: 10.7270/Q2639QRG
Nitric oxide synthase, endothelial
(Homo sapiens (Human))
BDBM50379744
(CHEMBL2011136)
Show SMILES CN1CCC(C1)N1CCCCc2cc(ccc12)N=C(N)c1cccs1 |w:17.19|
Show InChI InChI=1S/C20H26N4S/c1-23-11-9-17(14-23)24-10-3-2-5-15-13-16(7-8-18(15)24)22-20(21)19-6-4-12-25-19/h4,6-8,12-13,17H,2-3,5,9-11,14H2,1H3,(H2,21,22)
n/an/a 6.05E+4n/an/an/an/an/an/a
NeurAxon Inc.
Curated by ChEMBL
Assay Description
Inhibition of human recombinant eNOS expressed in baculovirus infected insect sf9 cells assessed as conversion of [3H]-L-arginine into [3H]-L-citrull...
Bioorg Med Chem Lett 22: 2510-3 (2012)
Article DOI: 10.1016/j.bmcl.2012.02.004
BindingDB Entry DOI: 10.7270/Q2639QRG