BDBM50380198 BONANNIONE A
SMILES: [#6]\[#6](-[#6])=[#6]\[#6]-[#6]\[#6](-[#6])=[#6]\[#6]-c1c(-[#8])cc2-[#8]-[#6@@H](-[#6]-[#6](=O)-c2c1-[#8])-c1ccc(-[#8])cc1
InChI Key: InChIKey=XYIQIBWIEGCVQY-RWHUQTJRSA-N
Data: 2 KI  4 IC50
Activity Spreadsheet -- Enzyme Inhibition Constant Data from BindingDB
Found 6 hits for monomerid = 50380198
Trg + Lig
Ki
nM
ΔG°
kcal/mole
IC50
nM
Kd
nM
EC50/IC50
nM
koff
s-1
kon
M-1s-1
pHTemp
°C
Butyrylcholinesterase (BChE)
(Equus caballus (Horse))
BDBM50380198
(BONANNIONE A)
Show SMILES [#6]\[#6](-[#6])=[#6]\[#6]-[#6]\[#6](-[#6])=[#6]\[#6]-c1c(-[#8])cc2-[#8]-[#6@@H](-[#6]-[#6](=O)-c2c1-[#8])-c1ccc(-[#8])cc1 |r|
Show InChI InChI=1S/C25H28O5/c1-15(2)5-4-6-16(3)7-12-19-20(27)13-23-24(25(19)29)21(28)14-22(30-23)17-8-10-18(26)11-9-17/h5,7-11,13,22,26-27,29H,4,6,12,14H2,1-3H3/b16-7+/t22-/m0/s1
2.22E+4n/an/an/an/an/an/an/an/a
Graduate School of Gyeongsang National University
Curated by ChEMBL
Assay Description
Mixed type inhibition of equine BChE using butyrylthiocholine iodide as substrate by Lineweaver-Burk double-reciprocal-plot and dixon plot analysis
Bioorg Med Chem 20: 2595-602 (2012)
Article DOI: 10.1016/j.bmc.2012.02.044
BindingDB Entry DOI: 10.7270/Q22808MC
Acetylcholinesterase
(Homo sapiens (Human))
BDBM50380198
(BONANNIONE A)
Show SMILES [#6]\[#6](-[#6])=[#6]\[#6]-[#6]\[#6](-[#6])=[#6]\[#6]-c1c(-[#8])cc2-[#8]-[#6@@H](-[#6]-[#6](=O)-c2c1-[#8])-c1ccc(-[#8])cc1 |r|
Show InChI InChI=1S/C25H28O5/c1-15(2)5-4-6-16(3)7-12-19-20(27)13-23-24(25(19)29)21(28)14-22(30-23)17-8-10-18(26)11-9-17/h5,7-11,13,22,26-27,29H,4,6,12,14H2,1-3H3/b16-7+/t22-/m0/s1
NCI pathway
Reactome pathway
1.21E+5n/an/an/an/an/an/an/an/a
Graduate School of Gyeongsang National University
Curated by ChEMBL
Assay Description
Mixed type inhibition of human erythrocyte AChE using acetylthiocholine iodide as substrate by Lineweaver-Burk double-reciprocal-plot and dixon plot ...
Bioorg Med Chem 20: 2595-602 (2012)
Article DOI: 10.1016/j.bmc.2012.02.044
BindingDB Entry DOI: 10.7270/Q22808MC
Prostaglandin E synthase/G/H synthase 2
(Homo sapiens (Human))
BDBM50380198
(BONANNIONE A)
Show SMILES [#6]\[#6](-[#6])=[#6]\[#6]-[#6]\[#6](-[#6])=[#6]\[#6]-c1c(-[#8])cc2-[#8]-[#6@@H](-[#6]-[#6](=O)-c2c1-[#8])-c1ccc(-[#8])cc1 |r|
Show InChI InChI=1S/C25H28O5/c1-15(2)5-4-6-16(3)7-12-19-20(27)13-23-24(25(19)29)21(28)14-22(30-23)17-8-10-18(26)11-9-17/h5,7-11,13,22,26-27,29H,4,6,12,14H2,1-3H3/b16-7+/t22-/m0/s1
NCI pathway
Reactome pathway
n/an/a 6.00E+3n/an/an/an/an/an/a
The Czech Academy of Sciences
Curated by ChEMBL
Assay Description
Inhibition of human recombinant COX2 assessed as reduction in PGE2 formation pre-incubated for 5 mins before arachidonic acid addition and measured a...
J Nat Prod 80: 999-1006 (2017)
Article DOI: 10.1021/acs.jnatprod.6b01011
BindingDB Entry DOI: 10.7270/Q2668GW1
Prostaglandin G/H synthase (cyclooxygenase)
(Ovis aries (Sheep))
BDBM50380198
(BONANNIONE A)
Show SMILES [#6]\[#6](-[#6])=[#6]\[#6]-[#6]\[#6](-[#6])=[#6]\[#6]-c1c(-[#8])cc2-[#8]-[#6@@H](-[#6]-[#6](=O)-c2c1-[#8])-c1ccc(-[#8])cc1 |r|
Show InChI InChI=1S/C25H28O5/c1-15(2)5-4-6-16(3)7-12-19-20(27)13-23-24(25(19)29)21(28)14-22(30-23)17-8-10-18(26)11-9-17/h5,7-11,13,22,26-27,29H,4,6,12,14H2,1-3H3/b16-7+/t22-/m0/s1
n/an/a 3.70E+3n/an/an/an/an/an/a
The Czech Academy of Sciences
Curated by ChEMBL
Assay Description
Inhibition of ram seminal vesicle COX1 assessed as reduction in PGE2 formation pre-incubated for 5 mins before arachidonic acid addition and measured...
J Nat Prod 80: 999-1006 (2017)
Article DOI: 10.1021/acs.jnatprod.6b01011
BindingDB Entry DOI: 10.7270/Q2668GW1
Acetylcholinesterase
(Homo sapiens (Human))
BDBM50380198
(BONANNIONE A)
Show SMILES [#6]\[#6](-[#6])=[#6]\[#6]-[#6]\[#6](-[#6])=[#6]\[#6]-c1c(-[#8])cc2-[#8]-[#6@@H](-[#6]-[#6](=O)-c2c1-[#8])-c1ccc(-[#8])cc1 |r|
Show InChI InChI=1S/C25H28O5/c1-15(2)5-4-6-16(3)7-12-19-20(27)13-23-24(25(19)29)21(28)14-22(30-23)17-8-10-18(26)11-9-17/h5,7-11,13,22,26-27,29H,4,6,12,14H2,1-3H3/b16-7+/t22-/m0/s1
NCI pathway
Reactome pathway
n/an/a 9.15E+4n/an/an/an/an/an/a
Graduate School of Gyeongsang National University
Curated by ChEMBL
Assay Description
Inhibition of human erythrocyte AChE assessed as acetylthiocholine iodide hydrolysis after 10 mins preincubation by spectrophotometry
Bioorg Med Chem 20: 2595-602 (2012)
Article DOI: 10.1016/j.bmc.2012.02.044
BindingDB Entry DOI: 10.7270/Q22808MC
Butyrylcholinesterase (BChE)
(Equus caballus (Horse))
BDBM50380198
(BONANNIONE A)
Show SMILES [#6]\[#6](-[#6])=[#6]\[#6]-[#6]\[#6](-[#6])=[#6]\[#6]-c1c(-[#8])cc2-[#8]-[#6@@H](-[#6]-[#6](=O)-c2c1-[#8])-c1ccc(-[#8])cc1 |r|
Show InChI InChI=1S/C25H28O5/c1-15(2)5-4-6-16(3)7-12-19-20(27)13-23-24(25(19)29)21(28)14-22(30-23)17-8-10-18(26)11-9-17/h5,7-11,13,22,26-27,29H,4,6,12,14H2,1-3H3/b16-7+/t22-/m0/s1
n/an/a 2.06E+4n/an/an/an/an/an/a
Graduate School of Gyeongsang National University
Curated by ChEMBL
Assay Description
Inhibition of equine BChE assessed as butyrylthiocholine iodide hydrolysis after 10 mins preincubation by spectrophotometry
Bioorg Med Chem 20: 2595-602 (2012)
Article DOI: 10.1016/j.bmc.2012.02.044
BindingDB Entry DOI: 10.7270/Q22808MC