BDBM50380208 CHEMBL2011408
SMILES: C[C@]12CC[C@H]3[C@@H](CCc4c3ccc(OS(N)(=O)=O)c4[N+]([O-])=O)[C@@H]1CCC2=O
InChI Key: InChIKey=HVZDCAIKDVGWCI-QDTBLXIISA-N
Data: 2 IC50
Activity Spreadsheet -- Enzyme Inhibition Constant Data from BindingDB
Found 2 hits for monomerid = 50380208
Trg + Lig
Ki
nM
ΔG°
kcal/mole
IC50
nM
Kd
nM
EC50/IC50
nM
koff
s-1
kon
M-1s-1
pHTemp
°C
Steryl-sulfatase
(Homo sapiens (Human))
BDBM50380208
(CHEMBL2011408)
Show SMILES C[C@]12CC[C@H]3[C@@H](CCc4c3ccc(OS(N)(=O)=O)c4[N+]([O-])=O)[C@@H]1CCC2=O |r|
Show InChI InChI=1S/C18H22N2O6S/c1-18-9-8-11-10-4-6-15(26-27(19,24)25)17(20(22)23)13(10)3-2-12(11)14(18)5-7-16(18)21/h4,6,11-12,14H,2-3,5,7-9H2,1H3,(H2,19,24,25)/t11-,12-,14+,18+/m1/s1
n/an/a 0.0100n/an/an/an/an/an/a
University of Bath
Curated by ChEMBL
Assay Description
Inhibition of steroid sulfatase in human MCF7 cells using [3H]E1S as substrate after 20 hrs by scintillation spectrometry
Bioorg Med Chem 20: 2506-19 (2012)
Article DOI: 10.1016/j.bmc.2012.03.007
BindingDB Entry DOI: 10.7270/Q2XG9S4J
Steryl-sulfatase
(Homo sapiens (Human))
BDBM50380208
(CHEMBL2011408)
Show SMILES C[C@]12CC[C@H]3[C@@H](CCc4c3ccc(OS(N)(=O)=O)c4[N+]([O-])=O)[C@@H]1CCC2=O |r|
Show InChI InChI=1S/C18H22N2O6S/c1-18-9-8-11-10-4-6-15(26-27(19,24)25)17(20(22)23)13(10)3-2-12(11)14(18)5-7-16(18)21/h4,6,11-12,14H,2-3,5,7-9H2,1H3,(H2,19,24,25)/t11-,12-,14+,18+/m1/s1
n/an/a 0.800n/an/an/an/an/an/a
University of Bath
Curated by ChEMBL
Assay Description
Inhibition of steroid sulfatase in human placental microsomes using [3H]E1S as substrate after 30 mins by scintillation spectrometry
Bioorg Med Chem 20: 2506-19 (2012)
Article DOI: 10.1016/j.bmc.2012.03.007
BindingDB Entry DOI: 10.7270/Q2XG9S4J