BDBM50380251 CHEMBL2017220
SMILES: CCc1ccccc1Nc1nc(nc2c(NCC3CC3)ncnc12)N1CCNCC1
InChI Key: InChIKey=FJWDTBVMTGQZHE-UHFFFAOYSA-N
Data: 1 IC50
Activity Spreadsheet -- Enzyme Inhibition Constant Data from BindingDB
Found 1 hit for monomerid = 50380251
Trg + Lig
Ki
nM
ΔG°
kcal/mole
IC50
nM
Kd
nM
EC50/IC50
nM
koff
s-1
kon
M-1s-1
pHTemp
°C
Ketohexokinase (KHK) Isoform C
(Homo sapiens (Human))
BDBM50380251
(CHEMBL2017220)
Show SMILES CCc1ccccc1Nc1nc(nc2c(NCC3CC3)ncnc12)N1CCNCC1
Show InChI InChI=1S/C22H28N8/c1-2-16-5-3-4-6-17(16)27-21-18-19(20(26-14-25-18)24-13-15-7-8-15)28-22(29-21)30-11-9-23-10-12-30/h3-6,14-15,23H,2,7-13H2,1H3,(H,24,25,26)(H,27,28,29)
n/an/a 130n/an/an/an/an/an/a
TBA
Curated by ChEMBL
Assay Description
Inhibition of human ketohexokinase isoform C expressed in Escherichia coli BL21 (DE3) cells using D-fructose as substrate after 12 to 15 mins by fluo...
ACS Med Chem Lett 2: 538-543 (2011)
Article DOI: 10.1021/ml200070g
BindingDB Entry DOI: 10.7270/Q2NZ88N1