BDBM50380287 CHEMBL2017256
SMILES: CSc1ccccc1Nc1nc(nc2c(NCC3CC3)ncnc12)N1CCN(C)CC1
InChI Key: InChIKey=WQRSBUAQNVYRRN-UHFFFAOYSA-N
Data: 1 IC50
Activity Spreadsheet -- Enzyme Inhibition Constant Data from BindingDB
Found 1 hit for monomerid = 50380287
Trg + Lig
Ki
nM
ΔG°
kcal/mole
IC50
nM
Kd
nM
EC50/IC50
nM
koff
s-1
kon
M-1s-1
pHTemp
°C
Ketohexokinase (KHK) Isoform C
(Homo sapiens (Human))
BDBM50380287
(CHEMBL2017256)
Show SMILES CSc1ccccc1Nc1nc(nc2c(NCC3CC3)ncnc12)N1CCN(C)CC1
Show InChI InChI=1S/C22H28N8S/c1-29-9-11-30(12-10-29)22-27-19-18(24-14-25-20(19)23-13-15-7-8-15)21(28-22)26-16-5-3-4-6-17(16)31-2/h3-6,14-15H,7-13H2,1-2H3,(H,23,24,25)(H,26,27,28)
n/an/a 110n/an/an/an/an/an/a
TBA
Curated by ChEMBL
Assay Description
Inhibition of human ketohexokinase isoform C expressed in Escherichia coli BL21 (DE3) cells using D-fructose as substrate after 12 to 15 mins by fluo...
ACS Med Chem Lett 2: 538-543 (2011)
Article DOI: 10.1021/ml200070g
BindingDB Entry DOI: 10.7270/Q2NZ88N1