BDBM50380307 CHEMBL2017461
SMILES: CC(C)N(C(=O)c1ccc(o1)-c1ccc(Cl)cc1)c1ccc(cc1)N1CCNCC1
InChI Key: InChIKey=YFRABOFOMDNCOG-UHFFFAOYSA-N
Data: 1 IC50  1 EC50
Activity Spreadsheet -- Enzyme Inhibition Constant Data from BindingDB
Found 2 hits for monomerid = 50380307
Trg + Lig
Ki
nM
ΔG°
kcal/mole
IC50
nM
Kd
nM
EC50/IC50
nM
koff
s-1
kon
M-1s-1
pHTemp
°C
MAP kinase-activated protein kinase 2
(Homo sapiens (Human))
BDBM50380307
(CHEMBL2017461)
Show SMILES CC(C)N(C(=O)c1ccc(o1)-c1ccc(Cl)cc1)c1ccc(cc1)N1CCNCC1
Show InChI InChI=1S/C24H26ClN3O2/c1-17(2)28(21-9-7-20(8-10-21)27-15-13-26-14-16-27)24(29)23-12-11-22(30-23)18-3-5-19(25)6-4-18/h3-12,17,26H,13-16H2,1-2H3
NCI pathway
Reactome pathway
n/an/a 1.20E+3n/an/an/an/an/an/a
TBA
Curated by ChEMBL
Assay Description
Inhibition of MK2 using Acam peptide as substrate incubated for 30 mins prior to substrate addition measured after 10 mins using 100 uM ATP by DELFIA...
ACS Med Chem Lett 2: 632-637 (2011)
Article DOI: 10.1021/ml200113y
BindingDB Entry DOI: 10.7270/Q2J967CS
MAP kinase-activated protein kinase 2
(Homo sapiens (Human))
BDBM50380307
(CHEMBL2017461)
Show SMILES CC(C)N(C(=O)c1ccc(o1)-c1ccc(Cl)cc1)c1ccc(cc1)N1CCNCC1
Show InChI InChI=1S/C24H26ClN3O2/c1-17(2)28(21-9-7-20(8-10-21)27-15-13-26-14-16-27)24(29)23-12-11-22(30-23)18-3-5-19(25)6-4-18/h3-12,17,26H,13-16H2,1-2H3
NCI pathway
Reactome pathway
n/an/an/an/a 2.70E+3n/an/an/an/a
TBA
Curated by ChEMBL
Assay Description
Inhibition of MK2-mediated HSP27 phosphorylation in IL-1beta stimulated human SW1353 cells incubated for 30 mins prior to IL-1beta-stimulation measur...
ACS Med Chem Lett 2: 632-637 (2011)
Article DOI: 10.1021/ml200113y
BindingDB Entry DOI: 10.7270/Q2J967CS