BDBM50380311 CHEMBL2017451
SMILES: OC1CCN(CC1)c1ccc(NC(=O)c2ccc(o2)-c2ccc(Cl)cc2)cc1
InChI Key: InChIKey=FVADYYQYUBQSIE-UHFFFAOYSA-N
Data: 1 IC50
Activity Spreadsheet -- Enzyme Inhibition Constant Data from BindingDB
Found 1 hit for monomerid = 50380311
Trg + Lig
Ki
nM
ΔG°
kcal/mole
IC50
nM
Kd
nM
EC50/IC50
nM
koff
s-1
kon
M-1s-1
pHTemp
°C
MAP kinase-activated protein kinase 2
(Homo sapiens (Human))
BDBM50380311
(CHEMBL2017451)
Show SMILES OC1CCN(CC1)c1ccc(NC(=O)c2ccc(o2)-c2ccc(Cl)cc2)cc1
Show InChI InChI=1S/C22H21ClN2O3/c23-16-3-1-15(2-4-16)20-9-10-21(28-20)22(27)24-17-5-7-18(8-6-17)25-13-11-19(26)12-14-25/h1-10,19,26H,11-14H2,(H,24,27)
NCI pathway
Reactome pathway
n/an/a>2.00E+4n/an/an/an/an/an/a
TBA
Curated by ChEMBL
Assay Description
Inhibition of MK2 using Acam peptide as substrate incubated for 30 mins prior to substrate addition measured after 10 mins using 100 uM ATP by DELFIA...
ACS Med Chem Lett 2: 632-637 (2011)
Article DOI: 10.1021/ml200113y
BindingDB Entry DOI: 10.7270/Q2J967CS