BDBM50380322 CHEMBL258208
SMILES: O[C@H](COP(O)(O)=O)[C@@H](O)[C@H](O)[C@H](O)COP(O)(O)=O
InChI Key: InChIKey=WOYYTQHMNDWRCW-KVTDHHQDSA-N
Data: 2 IC50
PDB links: 6 PDB IDs match this monomer.
Activity Spreadsheet -- Enzyme Inhibition Constant Data from BindingDB
Found 2 hits for monomerid = 50380322
Trg + Lig
Ki
nM
ΔG°
kcal/mole
IC50
nM
Kd
nM
EC50/IC50
nM
koff
s-1
kon
M-1s-1
pHTemp
°C
Fructose-bisphosphate aldolase A
(Oryctolagus cuniculus)
BDBM50380322
(CHEMBL258208)
Show SMILES O[C@H](COP(O)(O)=O)[C@@H](O)[C@H](O)[C@H](O)COP(O)(O)=O |r|
Show InChI InChI=1S/C6H16O12P2/c7-3(1-17-19(11,12)13)5(9)6(10)4(8)2-18-20(14,15)16/h3-10H,1-2H2,(H2,11,12,13)(H2,14,15,16)/t3-,4-,5-,6-/m1/s1
n/an/a 8.00E+3n/an/an/an/an/an/a
TBA
Curated by ChEMBL
Assay Description
Inhibition of rabbit muscle FBA assessed as inhibition of FBP cleavage by spectrophotometry
ACS Med Chem Lett 2: 804-808 (2011)
Article DOI: 10.1021/ml200129s
BindingDB Entry DOI: 10.7270/Q28S4QXB
3D
3D Structure (crystal)
Fructose-bisphosphate aldoloase, glycosomal
(Trypanosoma brucei brucei)
BDBM50380322
(CHEMBL258208)
Show SMILES O[C@H](COP(O)(O)=O)[C@@H](O)[C@H](O)[C@H](O)COP(O)(O)=O |r|
Show InChI InChI=1S/C6H16O12P2/c7-3(1-17-19(11,12)13)5(9)6(10)4(8)2-18-20(14,15)16/h3-10H,1-2H2,(H2,11,12,13)(H2,14,15,16)/t3-,4-,5-,6-/m1/s1
n/an/a 9.40E+3n/an/an/an/an/an/a
TBA
Curated by ChEMBL
Assay Description
Inhibition of His-tagged recombinant Trypanosoma brucei fructose bis-phosphate aldolase expressed in Escherichia coli using FBP as substrate after 5 ...
ACS Med Chem Lett 2: 804-808 (2011)
Article DOI: 10.1021/ml200129s
BindingDB Entry DOI: 10.7270/Q28S4QXB