BDBM50380328 CHEMBL2017790
SMILES: CCCCC[C@@](O)(COP(O)(O)=O)[C@@H](O)[C@H](O)[C@H](O)COP(O)(O)=O
InChI Key: InChIKey=GACFGVWHDZXULL-CHWFTXMASA-N
Data: 2 IC50
Activity Spreadsheet -- Enzyme Inhibition Constant Data from BindingDB
Found 2 hits for monomerid = 50380328
Trg + Lig
Ki
nM
ΔG°
kcal/mole
IC50
nM
Kd
nM
EC50/IC50
nM
koff
s-1
kon
M-1s-1
pHTemp
°C
Fructose-bisphosphate aldolase A
(Oryctolagus cuniculus)
BDBM50380328
(CHEMBL2017790)
Show SMILES CCCCC[C@@](O)(COP(O)(O)=O)[C@@H](O)[C@H](O)[C@H](O)COP(O)(O)=O |r|
Show InChI InChI=1S/C11H26O12P2/c1-2-3-4-5-11(15,7-23-25(19,20)21)10(14)9(13)8(12)6-22-24(16,17)18/h8-10,12-15H,2-7H2,1H3,(H2,16,17,18)(H2,19,20,21)/t8-,9-,10+,11-/m1/s1
n/an/a 1.70E+4n/an/an/an/an/an/a
TBA
Curated by ChEMBL
Assay Description
Inhibition of rabbit muscle FBA assessed as inhibition of FBP cleavage by spectrophotometry
ACS Med Chem Lett 2: 804-808 (2011)
Article DOI: 10.1021/ml200129s
BindingDB Entry DOI: 10.7270/Q28S4QXB
Fructose-bisphosphate aldoloase, glycosomal
(Trypanosoma brucei brucei)
BDBM50380328
(CHEMBL2017790)
Show SMILES CCCCC[C@@](O)(COP(O)(O)=O)[C@@H](O)[C@H](O)[C@H](O)COP(O)(O)=O |r|
Show InChI InChI=1S/C11H26O12P2/c1-2-3-4-5-11(15,7-23-25(19,20)21)10(14)9(13)8(12)6-22-24(16,17)18/h8-10,12-15H,2-7H2,1H3,(H2,16,17,18)(H2,19,20,21)/t8-,9-,10+,11-/m1/s1
n/an/a 1.50E+4n/an/an/an/an/an/a
TBA
Curated by ChEMBL
Assay Description
Inhibition of His-tagged recombinant Trypanosoma brucei fructose bis-phosphate aldolase expressed in Escherichia coli using FBP as substrate after 5 ...
ACS Med Chem Lett 2: 804-808 (2011)
Article DOI: 10.1021/ml200129s
BindingDB Entry DOI: 10.7270/Q28S4QXB