BDBM50380369 CHEMBL2017968
SMILES: Nc1ncc(c(N)n1)-c1cc(Nc2cnc3ccccc3c2)nc(n1)N1CCOCC1
InChI Key: InChIKey=GBJKAVZJDAJVMO-UHFFFAOYSA-N
Data: 1 IC50
Activity Spreadsheet -- Enzyme Inhibition Constant Data from BindingDB
Found 1 hit for monomerid = 50380369
Trg + Lig
Ki
nM
ΔG°
kcal/mole
IC50
nM
Kd
nM
EC50/IC50
nM
koff
s-1
kon
M-1s-1
pHTemp
°C
Phosphatidylinositol 4,5-bisphosphate 3-kinase catalytic subunit alpha isoform
(Homo sapiens (Human))
BDBM50380369
(CHEMBL2017968)
Show SMILES Nc1ncc(c(N)n1)-c1cc(Nc2cnc3ccccc3c2)nc(n1)N1CCOCC1
Show InChI InChI=1S/C21H21N9O/c22-19-15(12-25-20(23)29-19)17-10-18(28-21(27-17)30-5-7-31-8-6-30)26-14-9-13-3-1-2-4-16(13)24-11-14/h1-4,9-12H,5-8H2,(H,26,27,28)(H4,22,23,25,29)
NCI pathway
Reactome pathway
n/an/a 2.60n/an/an/an/an/an/a
TBA
Curated by ChEMBL
Assay Description
Inhibition of PI3Kalpha using 1-alpha-phosphotidylinositol as substrate by ATP depletion assay
ACS Med Chem Lett 2: 774-779 (2011)
Article DOI: 10.1021/ml200156t
BindingDB Entry DOI: 10.7270/Q2N29XXW