BDBM50380394 CHEMBL2018443
SMILES: ONC(=O)c1ccc(Cn2c3CCN(Cc4ccccc4)Cc3c3ccccc23)cc1
InChI Key: InChIKey=FVDLSLVXMKRWCG-UHFFFAOYSA-N
Data: 2 IC50
Activity Spreadsheet -- Enzyme Inhibition Constant Data from BindingDB
Found 2 hits for monomerid = 50380394
Trg + Lig
Ki
nM
ΔG°
kcal/mole
IC50
nM
Kd
nM
EC50/IC50
nM
koff
s-1
kon
M-1s-1
pHTemp
°C
Histone deacetylase 1
(Homo sapiens (Human))
BDBM50380394
(CHEMBL2018443)
Show SMILES ONC(=O)c1ccc(Cn2c3CCN(Cc4ccccc4)Cc3c3ccccc23)cc1
Show InChI InChI=1S/C26H25N3O2/c30-26(27-31)21-12-10-20(11-13-21)17-29-24-9-5-4-8-22(24)23-18-28(15-14-25(23)29)16-19-6-2-1-3-7-19/h1-13,31H,14-18H2,(H,27,30)
NCI pathway
Reactome pathway
n/an/a 1.03E+4n/an/an/an/an/an/a
University of Illinois at Chicago
Curated by ChEMBL
Assay Description
Inhibition of human recombinant HDAC1 using RHKKAc peptide as substrate incubated for 5 to mins prior to substrate addition measured after 2 hrs
J Med Chem 55: 639-51 (2012)
Article DOI: 10.1021/jm200773h
BindingDB Entry DOI: 10.7270/Q2CJ8FG7
Cereblon/Histone deacetylase 6
(Homo sapiens (Human))
BDBM50380394
(CHEMBL2018443)
Show SMILES ONC(=O)c1ccc(Cn2c3CCN(Cc4ccccc4)Cc3c3ccccc23)cc1
Show InChI InChI=1S/C26H25N3O2/c30-26(27-31)21-12-10-20(11-13-21)17-29-24-9-5-4-8-22(24)23-18-28(15-14-25(23)29)16-19-6-2-1-3-7-19/h1-13,31H,14-18H2,(H,27,30)
NCI pathway
Reactome pathway
n/an/a 1.44n/an/an/an/an/an/a
University of Illinois at Chicago
Curated by ChEMBL
Assay Description
Inhibition of human recombinant HDAC6 using RHKKAc peptide as substrate incubated for 5 to mins prior to substrate addition measured after 2 hrs
J Med Chem 55: 639-51 (2012)
Article DOI: 10.1021/jm200773h
BindingDB Entry DOI: 10.7270/Q2CJ8FG7