BDBM50380406 CHEMBL2018295
SMILES: CN1CCc2c(C1)c1ccc(C)cc1n2Cc1ccc(cc1)C(=O)NO
InChI Key: InChIKey=BHKGZSMGHYSGNO-UHFFFAOYSA-N
Data: 2 IC50
Activity Spreadsheet -- Enzyme Inhibition Constant Data from BindingDB
Found 2 hits for monomerid = 50380406
Trg + Lig
Ki
nM
ΔG°
kcal/mole
IC50
nM
Kd
nM
EC50/IC50
nM
koff
s-1
kon
M-1s-1
pHTemp
°C
Histone deacetylase 1
(Homo sapiens (Human))
BDBM50380406
(CHEMBL2018295)
Show SMILES CN1CCc2c(C1)c1ccc(C)cc1n2Cc1ccc(cc1)C(=O)NO
Show InChI InChI=1S/C21H23N3O2/c1-14-3-8-17-18-13-23(2)10-9-19(18)24(20(17)11-14)12-15-4-6-16(7-5-15)21(25)22-26/h3-8,11,26H,9-10,12-13H2,1-2H3,(H,22,25)
NCI pathway
Reactome pathway
n/an/a 4.05E+3n/an/an/an/an/an/a
University of Illinois at Chicago
Curated by ChEMBL
Assay Description
Inhibition of human recombinant HDAC1 using RHKKAc peptide as substrate incubated for 5 to mins prior to substrate addition measured after 2 hrs
J Med Chem 55: 639-51 (2012)
Article DOI: 10.1021/jm200773h
BindingDB Entry DOI: 10.7270/Q2CJ8FG7
Cereblon/Histone deacetylase 6
(Homo sapiens (Human))
BDBM50380406
(CHEMBL2018295)
Show SMILES CN1CCc2c(C1)c1ccc(C)cc1n2Cc1ccc(cc1)C(=O)NO
Show InChI InChI=1S/C21H23N3O2/c1-14-3-8-17-18-13-23(2)10-9-19(18)24(20(17)11-14)12-15-4-6-16(7-5-15)21(25)22-26/h3-8,11,26H,9-10,12-13H2,1-2H3,(H,22,25)
NCI pathway
Reactome pathway
n/an/a 11.5n/an/an/an/an/an/a
University of Illinois at Chicago
Curated by ChEMBL
Assay Description
Inhibition of human recombinant HDAC6 using RHKKAc peptide as substrate incubated for 5 to mins prior to substrate addition measured after 2 hrs
J Med Chem 55: 639-51 (2012)
Article DOI: 10.1021/jm200773h
BindingDB Entry DOI: 10.7270/Q2CJ8FG7