BDBM50380518 CHEMBL2018906
SMILES: CCSc1nc2ccc(OC)cc2[nH]1
InChI Key: InChIKey=CZSQXDMMIUJHSK-UHFFFAOYSA-N
Data: 1 KI  8 IC50
Activity Spreadsheet -- Enzyme Inhibition Constant Data from BindingDB
Found 9 hits for monomerid = 50380518
Trg + Lig
Ki
nM
ΔG°
kcal/mole
IC50
nM
Kd
nM
EC50/IC50
nM
koff
s-1
kon
M-1s-1
pHTemp
°C
Cytochrome P450 2C19
(Homo sapiens (Human))
BDBM50380518
(CHEMBL2018906)
Show SMILES CCSc1nc2ccc(OC)cc2[nH]1
Show InChI InChI=1S/C10H12N2OS/c1-3-14-10-11-8-5-4-7(13-2)6-9(8)12-10/h4-6H,3H2,1-2H3,(H,11,12)
Reactome pathway
4.25E+4n/an/an/an/an/an/an/an/a
Amgen Inc.
Curated by ChEMBL
Assay Description
Inhibition of recombinant CYP2C19 using 3-O-methylfluorescein as substrate preincubated for 3 mins
J Med Chem 55: 1205-14 (2012)
Article DOI: 10.1021/jm201346g
BindingDB Entry DOI: 10.7270/Q2QV3NHG
Cytochrome P450 3A4
(Homo sapiens (Human))
BDBM50380518
(CHEMBL2018906)
Show SMILES CCSc1nc2ccc(OC)cc2[nH]1
Show InChI InChI=1S/C10H12N2OS/c1-3-14-10-11-8-5-4-7(13-2)6-9(8)12-10/h4-6H,3H2,1-2H3,(H,11,12)
Reactome pathway
n/an/a 5.00E+4n/an/an/an/an/an/a
Amgen Inc.
Curated by ChEMBL
Assay Description
Inhibition of CYP3A4 in human liver microsomes using midazolam as substrate preincubated for 5 mins by LC-MS/MS analysis
J Med Chem 55: 1205-14 (2012)
Article DOI: 10.1021/jm201346g
BindingDB Entry DOI: 10.7270/Q2QV3NHG
Cytochrome P450 2B6
(Homo sapiens (Human))
BDBM50380518
(CHEMBL2018906)
Show SMILES CCSc1nc2ccc(OC)cc2[nH]1
Show InChI InChI=1S/C10H12N2OS/c1-3-14-10-11-8-5-4-7(13-2)6-9(8)12-10/h4-6H,3H2,1-2H3,(H,11,12)
n/an/a 5.10E+3n/an/an/an/an/an/a
Amgen Inc.
Curated by ChEMBL
Assay Description
Inhibition of CYP2B6 in human liver microsomes using bupropion as substrate preincubated for 5 mins by LC-MS/MS analysis
J Med Chem 55: 1205-14 (2012)
Article DOI: 10.1021/jm201346g
BindingDB Entry DOI: 10.7270/Q2QV3NHG
Cytochrome P450 2C19
(Homo sapiens (Human))
BDBM50380518
(CHEMBL2018906)
Show SMILES CCSc1nc2ccc(OC)cc2[nH]1
Show InChI InChI=1S/C10H12N2OS/c1-3-14-10-11-8-5-4-7(13-2)6-9(8)12-10/h4-6H,3H2,1-2H3,(H,11,12)
Reactome pathway
n/an/a 5.00E+4n/an/an/an/an/an/a
Amgen Inc.
Curated by ChEMBL
Assay Description
Inhibition of CYP2C19 in human liver microsomes using (S)-mpheytoin as substrate preincubated for 5 mins by LC-MS/MS analysis
J Med Chem 55: 1205-14 (2012)
Article DOI: 10.1021/jm201346g
BindingDB Entry DOI: 10.7270/Q2QV3NHG
Cytochrome P450 2D6
(Homo sapiens (Human))
BDBM50380518
(CHEMBL2018906)
Show SMILES CCSc1nc2ccc(OC)cc2[nH]1
Show InChI InChI=1S/C10H12N2OS/c1-3-14-10-11-8-5-4-7(13-2)6-9(8)12-10/h4-6H,3H2,1-2H3,(H,11,12)
n/an/a 4.93E+3n/an/an/an/an/an/a
Amgen Inc.
Curated by ChEMBL
Assay Description
Inhibition of CYP2D6 in human liver microsomes using dextromethorphan as substrate preincubated for 5 mins by LC-MS/MS analysis
J Med Chem 55: 1205-14 (2012)
Article DOI: 10.1021/jm201346g
BindingDB Entry DOI: 10.7270/Q2QV3NHG
Cytochrome P450 2E1
(Homo sapiens (Human))
BDBM50380518
(CHEMBL2018906)
Show SMILES CCSc1nc2ccc(OC)cc2[nH]1
Show InChI InChI=1S/C10H12N2OS/c1-3-14-10-11-8-5-4-7(13-2)6-9(8)12-10/h4-6H,3H2,1-2H3,(H,11,12)
Reactome pathway
n/an/a 5.00E+4n/an/an/an/an/an/a
Amgen Inc.
Curated by ChEMBL
Assay Description
Inhibition of CYP2E1 in human liver microsomes using chlorzoxazone as substrate preincubated for 5 mins by LC-MS/MS analysis
J Med Chem 55: 1205-14 (2012)
Article DOI: 10.1021/jm201346g
BindingDB Entry DOI: 10.7270/Q2QV3NHG
Cytochrome P450 1A
(Homo sapiens (Human))
BDBM50380518
(CHEMBL2018906)
Show SMILES CCSc1nc2ccc(OC)cc2[nH]1
Show InChI InChI=1S/C10H12N2OS/c1-3-14-10-11-8-5-4-7(13-2)6-9(8)12-10/h4-6H,3H2,1-2H3,(H,11,12)
Reactome pathway
n/an/a 2.34E+3n/an/an/an/an/an/a
Amgen Inc.
Curated by ChEMBL
Assay Description
Inhibition of CYP1A2 in human liver microsomes using phenacetin preincubated for 5 mins by LC-MS/MS analysis
J Med Chem 55: 1205-14 (2012)
Article DOI: 10.1021/jm201346g
BindingDB Entry DOI: 10.7270/Q2QV3NHG
Cytochrome P450 2C9
(Homo sapiens (Human))
BDBM50380518
(CHEMBL2018906)
Show SMILES CCSc1nc2ccc(OC)cc2[nH]1
Show InChI InChI=1S/C10H12N2OS/c1-3-14-10-11-8-5-4-7(13-2)6-9(8)12-10/h4-6H,3H2,1-2H3,(H,11,12)
Reactome pathway
n/an/a 5.00E+4n/an/an/an/an/an/a
Amgen Inc.
Curated by ChEMBL
Assay Description
Inhibition of CYP2C9 in human liver microsomes using diclofenac as substrate preincubated for 5 mins by LC-MS/MS analysis
J Med Chem 55: 1205-14 (2012)
Article DOI: 10.1021/jm201346g
BindingDB Entry DOI: 10.7270/Q2QV3NHG
Cytochrome P450 2C8
(Homo sapiens (Human))
BDBM50380518
(CHEMBL2018906)
Show SMILES CCSc1nc2ccc(OC)cc2[nH]1
Show InChI InChI=1S/C10H12N2OS/c1-3-14-10-11-8-5-4-7(13-2)6-9(8)12-10/h4-6H,3H2,1-2H3,(H,11,12)
n/an/a 6.97E+3n/an/an/an/an/an/a
Amgen Inc.
Curated by ChEMBL
Assay Description
Inhibition of CYP2C8 in human liver microsomes using paclitaxel as substrate preincubated for 5 mins by LC-MS/MS analysis
J Med Chem 55: 1205-14 (2012)
Article DOI: 10.1021/jm201346g
BindingDB Entry DOI: 10.7270/Q2QV3NHG