BDBM50380547 CHEMBL2019053
SMILES: Oc1cc2oc(cc(=O)c2cc1O)C(=O)NCCCCCCCCCCNc1c2CCCCc2nc2cc(Cl)ccc12
InChI Key: InChIKey=VNWJCXLTKRADKP-UHFFFAOYSA-N
Data: 1 KI  5 IC50
Activity Spreadsheet -- Enzyme Inhibition Constant Data from BindingDB
Found 6 hits for monomerid = 50380547
Trg + Lig
Ki
nM
ΔG°
kcal/mole
IC50
nM
Kd
nM
EC50/IC50
nM
koff
s-1
kon
M-1s-1
pHTemp
°C
Beta-secretase 1
(Homo sapiens (Human))
BDBM50380547
(CHEMBL2019053)
Show SMILES Oc1cc2oc(cc(=O)c2cc1O)C(=O)NCCCCCCCCCCNc1c2CCCCc2nc2cc(Cl)ccc12
Show InChI InChI=1S/C33H38ClN3O5/c34-21-13-14-23-26(17-21)37-25-12-8-7-11-22(25)32(23)35-15-9-5-3-1-2-4-6-10-16-36-33(41)31-19-27(38)24-18-28(39)29(40)20-30(24)42-31/h13-14,17-20,39-40H,1-12,15-16H2,(H,35,37)(H,36,41)
3.99E+3n/an/an/an/an/an/an/an/a
Instituto de Qu£mica M£dica
Curated by ChEMBL
Assay Description
Competitive inhibition of human recombinant BChE using panvera peptide as substrate preincubated for 60 mins before substrate addition by FRET assay
J Med Chem 55: 1303-17 (2012)
Article DOI: 10.1021/jm201460y
BindingDB Entry DOI: 10.7270/Q2M32WS2
Acetylcholinesterase
(Homo sapiens (Human))
BDBM50380547
(CHEMBL2019053)
Show SMILES Oc1cc2oc(cc(=O)c2cc1O)C(=O)NCCCCCCCCCCNc1c2CCCCc2nc2cc(Cl)ccc12
Show InChI InChI=1S/C33H38ClN3O5/c34-21-13-14-23-26(17-21)37-25-12-8-7-11-22(25)32(23)35-15-9-5-3-1-2-4-6-10-16-36-33(41)31-19-27(38)24-18-28(39)29(40)20-30(24)42-31/h13-14,17-20,39-40H,1-12,15-16H2,(H,35,37)(H,36,41)
NCI pathway
Reactome pathway
n/an/a 0.0900n/an/an/an/an/an/a
Instituto de Qu£mica M£dica
Curated by ChEMBL
Assay Description
Inhibition of human erythrocytes AChE by Ellman's method
J Med Chem 55: 1303-17 (2012)
Article DOI: 10.1021/jm201460y
BindingDB Entry DOI: 10.7270/Q2M32WS2
Acetylcholinesterase
(Bos taurus (bovine))
BDBM50380547
(CHEMBL2019053)
Show SMILES Oc1cc2oc(cc(=O)c2cc1O)C(=O)NCCCCCCCCCCNc1c2CCCCc2nc2cc(Cl)ccc12
Show InChI InChI=1S/C33H38ClN3O5/c34-21-13-14-23-26(17-21)37-25-12-8-7-11-22(25)32(23)35-15-9-5-3-1-2-4-6-10-16-36-33(41)31-19-27(38)24-18-28(39)29(40)20-30(24)42-31/h13-14,17-20,39-40H,1-12,15-16H2,(H,35,37)(H,36,41)
Reactome pathway
n/an/a 18n/an/an/an/an/an/a
Instituto de Qu£mica M£dica
Curated by ChEMBL
Assay Description
Inhibition of bovine erythrocytes AChE by Ellman's method
J Med Chem 55: 1303-17 (2012)
Article DOI: 10.1021/jm201460y
BindingDB Entry DOI: 10.7270/Q2M32WS2
Cholinesterases
(Homo sapiens (Human))
BDBM50380547
(CHEMBL2019053)
Show SMILES Oc1cc2oc(cc(=O)c2cc1O)C(=O)NCCCCCCCCCCNc1c2CCCCc2nc2cc(Cl)ccc12
Show InChI InChI=1S/C33H38ClN3O5/c34-21-13-14-23-26(17-21)37-25-12-8-7-11-22(25)32(23)35-15-9-5-3-1-2-4-6-10-16-36-33(41)31-19-27(38)24-18-28(39)29(40)20-30(24)42-31/h13-14,17-20,39-40H,1-12,15-16H2,(H,35,37)(H,36,41)
Reactome pathway
n/an/a 95n/an/an/an/an/an/a
Instituto de Qu£mica M£dica
Curated by ChEMBL
Assay Description
Inhibition of human serum BChE by Ellman's method
J Med Chem 55: 1303-17 (2012)
Article DOI: 10.1021/jm201460y
BindingDB Entry DOI: 10.7270/Q2M32WS2
Beta-secretase 1
(Homo sapiens (Human))
BDBM50380547
(CHEMBL2019053)
Show SMILES Oc1cc2oc(cc(=O)c2cc1O)C(=O)NCCCCCCCCCCNc1c2CCCCc2nc2cc(Cl)ccc12
Show InChI InChI=1S/C33H38ClN3O5/c34-21-13-14-23-26(17-21)37-25-12-8-7-11-22(25)32(23)35-15-9-5-3-1-2-4-6-10-16-36-33(41)31-19-27(38)24-18-28(39)29(40)20-30(24)42-31/h13-14,17-20,39-40H,1-12,15-16H2,(H,35,37)(H,36,41)
n/an/a 1.36E+4n/an/an/an/an/an/a
Instituto de Qu£mica M£dica
Curated by ChEMBL
Assay Description
Inhibition of human recombinant BChE using panvera peptide as substrate preincubated for 60 mins before substrate addition by FRET assay
J Med Chem 55: 1303-17 (2012)
Article DOI: 10.1021/jm201460y
BindingDB Entry DOI: 10.7270/Q2M32WS2
Butyrylcholinesterase (BuChE)
(Equus caballus (Horse))
BDBM50380547
(CHEMBL2019053)
Show SMILES Oc1cc2oc(cc(=O)c2cc1O)C(=O)NCCCCCCCCCCNc1c2CCCCc2nc2cc(Cl)ccc12
Show InChI InChI=1S/C33H38ClN3O5/c34-21-13-14-23-26(17-21)37-25-12-8-7-11-22(25)32(23)35-15-9-5-3-1-2-4-6-10-16-36-33(41)31-19-27(38)24-18-28(39)29(40)20-30(24)42-31/h13-14,17-20,39-40H,1-12,15-16H2,(H,35,37)(H,36,41)
n/an/a 28n/an/an/an/an/an/a
Instituto de Qu£mica M£dica
Curated by ChEMBL
Assay Description
Inhibition of horse serum BChE by Ellman's method
J Med Chem 55: 1303-17 (2012)
Article DOI: 10.1021/jm201460y
BindingDB Entry DOI: 10.7270/Q2M32WS2