BDBM50380984 CHEMBL2016936
SMILES: O[C@@]1(CCNC[C@@H]1c1cc(no1)-c1c(Cl)cccc1Cl)c1ccc(F)c(F)c1
InChI Key: InChIKey=UPRILTGQBKRVGC-ODXCJYRJSA-N
Data: 1 KI  3 IC50
Activity Spreadsheet -- Enzyme Inhibition Constant Data from BindingDB
Found 4 hits for monomerid = 50380984
Trg + Lig
Ki
nM
ΔG°
kcal/mole
IC50
nM
Kd
nM
EC50/IC50
nM
koff
s-1
kon
M-1s-1
pHTemp
°C
Potassium voltage-gated channel subfamily H member 2
(Homo sapiens (Human))
BDBM50380984
(CHEMBL2016936)
Show SMILES O[C@@]1(CCNC[C@@H]1c1cc(no1)-c1c(Cl)cccc1Cl)c1ccc(F)c(F)c1 |r|
Show InChI InChI=1S/C20H16Cl2F2N2O2/c21-13-2-1-3-14(22)19(13)17-9-18(28-26-17)12-10-25-7-6-20(12,27)11-4-5-15(23)16(24)8-11/h1-5,8-9,12,25,27H,6-7,10H2/t12-,20+/m1/s1
Reactome pathway
2.80E+3n/an/an/an/an/an/an/an/a
Merck Frosst Centre for Therapeutic Research
Curated by ChEMBL
Assay Description
Binding affinity to human Erg
Bioorg Med Chem Lett 22: 2670-4 (2012)
Article DOI: 10.1016/j.bmcl.2012.03.014
BindingDB Entry DOI: 10.7270/Q2MW2J5S
Cytochrome P450 3A4
(Homo sapiens (Human))
BDBM50380984
(CHEMBL2016936)
Show SMILES O[C@@]1(CCNC[C@@H]1c1cc(no1)-c1c(Cl)cccc1Cl)c1ccc(F)c(F)c1 |r|
Show InChI InChI=1S/C20H16Cl2F2N2O2/c21-13-2-1-3-14(22)19(13)17-9-18(28-26-17)12-10-25-7-6-20(12,27)11-4-5-15(23)16(24)8-11/h1-5,8-9,12,25,27H,6-7,10H2/t12-,20+/m1/s1
Reactome pathway
n/an/a 8.00E+3n/an/an/an/an/an/a
Merck Frosst Centre for Therapeutic Research
Curated by ChEMBL
Assay Description
Reversible inhibition of CYP3A4-mediated conversion of testosterone to 6-beta-hydroxy-testosterone after 30 mins
Bioorg Med Chem Lett 22: 2670-4 (2012)
Article DOI: 10.1016/j.bmcl.2012.03.014
BindingDB Entry DOI: 10.7270/Q2MW2J5S
Renin
(Homo sapiens (Human))
BDBM50380984
(CHEMBL2016936)
Show SMILES O[C@@]1(CCNC[C@@H]1c1cc(no1)-c1c(Cl)cccc1Cl)c1ccc(F)c(F)c1 |r|
Show InChI InChI=1S/C20H16Cl2F2N2O2/c21-13-2-1-3-14(22)19(13)17-9-18(28-26-17)12-10-25-7-6-20(12,27)11-4-5-15(23)16(24)8-11/h1-5,8-9,12,25,27H,6-7,10H2/t12-,20+/m1/s1
Reactome pathway
n/an/a 1.21E+3n/an/an/an/an/an/a
Merck Frosst Centre for Therapeutic Research
Curated by ChEMBL
Assay Description
Inhibition of human recombinant renin using DNP-Lys-His-Pro-Phe-His-Leu-Val-Ile-His-D,L-Amp as substrate after 3 hrs by fluorescence analysis
Bioorg Med Chem Lett 22: 2670-4 (2012)
Article DOI: 10.1016/j.bmcl.2012.03.014
BindingDB Entry DOI: 10.7270/Q2MW2J5S
Renin
(Homo sapiens (Human))
BDBM50380984
(CHEMBL2016936)
Show SMILES O[C@@]1(CCNC[C@@H]1c1cc(no1)-c1c(Cl)cccc1Cl)c1ccc(F)c(F)c1 |r|
Show InChI InChI=1S/C20H16Cl2F2N2O2/c21-13-2-1-3-14(22)19(13)17-9-18(28-26-17)12-10-25-7-6-20(12,27)11-4-5-15(23)16(24)8-11/h1-5,8-9,12,25,27H,6-7,10H2/t12-,20+/m1/s1
Reactome pathway
n/an/a>9.50E+3n/an/an/an/an/an/a
Merck Frosst Centre for Therapeutic Research
Curated by ChEMBL
Assay Description
Inhibition of human recombinant renin using DNP-Lys-His-Pro-Phe-His-Leu-Val-Ile-His-D,L-Amp as substrate pretreated for 10 mins measured after 3 hrs ...
Bioorg Med Chem Lett 22: 2670-4 (2012)
Article DOI: 10.1016/j.bmcl.2012.03.014
BindingDB Entry DOI: 10.7270/Q2MW2J5S