BDBM50381105 CHEMBL2017720
SMILES: C1CC1c1cc(Nc2ccnc(n2)-c2cccnc2)[nH]n1
InChI Key: InChIKey=VGGLCLRJOAFYQO-UHFFFAOYSA-N
Data: 1 IC50
Activity Spreadsheet -- Enzyme Inhibition Constant Data from BindingDB
Found 1 hit for monomerid = 50381105
Trg + Lig
Ki
nM
ΔG°
kcal/mole
IC50
nM
Kd
nM
EC50/IC50
nM
koff
s-1
kon
M-1s-1
pHTemp
°C
Serine/threonine-protein kinase pknB
(Mycobacterium tuberculosis)
BDBM50381105
(CHEMBL2017720)
Show SMILES C1CC1c1cc(Nc2ccnc(n2)-c2cccnc2)[nH]n1
Show InChI InChI=1S/C15H14N6/c1-2-11(9-16-6-1)15-17-7-5-13(19-15)18-14-8-12(20-21-14)10-3-4-10/h1-2,5-10H,3-4H2,(H2,17,18,19,20,21)
n/an/a 202n/an/an/an/an/an/a
MRC Technology
Curated by ChEMBL
Assay Description
Inhibition of Mycobacterium tuberculosis GST-fused PknB expressed in Escherichia coli assessed as GarA substrate phosphorylation after 30 mins
Bioorg Med Chem Lett 22: 3349-53 (2012)
Article DOI: 10.1016/j.bmcl.2012.02.107
BindingDB Entry DOI: 10.7270/Q22Z16JX