BDBM50381110 CHEMBL2017710
SMILES: Fc1ccc(cc1)-c1nc(Nc2cc(n[nH]2)C2CC2)c2ccccc2n1
InChI Key: InChIKey=UNZSDXRINAKFIJ-UHFFFAOYSA-N
Data: 1 IC50
Activity Spreadsheet -- Enzyme Inhibition Constant Data from BindingDB
Found 1 hit for monomerid = 50381110
Trg + Lig
Ki
nM
ΔG°
kcal/mole
IC50
nM
Kd
nM
EC50/IC50
nM
koff
s-1
kon
M-1s-1
pHTemp
°C
Serine/threonine-protein kinase pknB
(Mycobacterium tuberculosis)
BDBM50381110
(CHEMBL2017710)
Show SMILES Fc1ccc(cc1)-c1nc(Nc2cc(n[nH]2)C2CC2)c2ccccc2n1
Show InChI InChI=1S/C20H16FN5/c21-14-9-7-13(8-10-14)19-22-16-4-2-1-3-15(16)20(24-19)23-18-11-17(25-26-18)12-5-6-12/h1-4,7-12H,5-6H2,(H2,22,23,24,25,26)
n/an/a 223n/an/an/an/an/an/a
MRC Technology
Curated by ChEMBL
Assay Description
Inhibition of Mycobacterium tuberculosis GST-fused PknB expressed in Escherichia coli assessed as GarA substrate phosphorylation after 30 mins
Bioorg Med Chem Lett 22: 3349-53 (2012)
Article DOI: 10.1016/j.bmcl.2012.02.107
BindingDB Entry DOI: 10.7270/Q22Z16JX