BDBM50381116 CHEMBL2017716
SMILES: CS(=O)(=O)Nc1cccc(c1)-c1nccc(Nc2cc(n[nH]2)C2CC2)n1
InChI Key: InChIKey=FYTPLMUJRNLUPI-UHFFFAOYSA-N
Data: 1 IC50
Activity Spreadsheet -- Enzyme Inhibition Constant Data from BindingDB
Found 1 hit for monomerid = 50381116
Trg + Lig
Ki
nM
ΔG°
kcal/mole
IC50
nM
Kd
nM
EC50/IC50
nM
koff
s-1
kon
M-1s-1
pHTemp
°C
Serine/threonine-protein kinase pknB
(Mycobacterium tuberculosis)
BDBM50381116
(CHEMBL2017716)
Show SMILES CS(=O)(=O)Nc1cccc(c1)-c1nccc(Nc2cc(n[nH]2)C2CC2)n1
Show InChI InChI=1S/C17H18N6O2S/c1-26(24,25)23-13-4-2-3-12(9-13)17-18-8-7-15(20-17)19-16-10-14(21-22-16)11-5-6-11/h2-4,7-11,23H,5-6H2,1H3,(H2,18,19,20,21,22)
n/an/a 393n/an/an/an/an/an/a
MRC Technology
Curated by ChEMBL
Assay Description
Inhibition of Mycobacterium tuberculosis GST-fused PknB expressed in Escherichia coli assessed as GarA substrate phosphorylation after 30 mins
Bioorg Med Chem Lett 22: 3349-53 (2012)
Article DOI: 10.1016/j.bmcl.2012.02.107
BindingDB Entry DOI: 10.7270/Q22Z16JX