BDBM50381128 CHEMBL2017729
SMILES: CN1CCN(CC1)c1cc(Nc2cc(n[nH]2)C2CC2)nc(n1)-c1ccccc1
InChI Key: InChIKey=DPQONKTXXSIFKR-UHFFFAOYSA-N
Data: 1 IC50
Activity Spreadsheet -- Enzyme Inhibition Constant Data from BindingDB
Found 1 hit for monomerid = 50381128
Trg + Lig
Ki
nM
ΔG°
kcal/mole
IC50
nM
Kd
nM
EC50/IC50
nM
koff
s-1
kon
M-1s-1
pHTemp
°C
Serine/threonine-protein kinase pknB
(Mycobacterium tuberculosis)
BDBM50381128
(CHEMBL2017729)
Show SMILES CN1CCN(CC1)c1cc(Nc2cc(n[nH]2)C2CC2)nc(n1)-c1ccccc1
Show InChI InChI=1S/C21H25N7/c1-27-9-11-28(12-10-27)20-14-18(22-19-13-17(25-26-19)15-7-8-15)23-21(24-20)16-5-3-2-4-6-16/h2-6,13-15H,7-12H2,1H3,(H2,22,23,24,25,26)
n/an/a 121n/an/an/an/an/an/a
MRC Technology
Curated by ChEMBL
Assay Description
Inhibition of Mycobacterium tuberculosis GST-fused PknB expressed in Escherichia coli assessed as GarA substrate phosphorylation after 30 mins
Bioorg Med Chem Lett 22: 3349-53 (2012)
Article DOI: 10.1016/j.bmcl.2012.02.107
BindingDB Entry DOI: 10.7270/Q22Z16JX