BDBM50381136 CHEMBL2017737
SMILES: CN1CCC(CNc2cc(Nc3cc(n[nH]3)C3CC3)nc(n2)-c2cccc(c2)S(C)(=O)=O)CC1
InChI Key: InChIKey=MSVJWTXNMZSJHD-UHFFFAOYSA-N
Data: 1 IC50
Activity Spreadsheet -- Enzyme Inhibition Constant Data from BindingDB
Found 1 hit for monomerid = 50381136
Trg + Lig
Ki
nM
ΔG°
kcal/mole
IC50
nM
Kd
nM
EC50/IC50
nM
koff
s-1
kon
M-1s-1
pHTemp
°C
Serine/threonine-protein kinase pknB
(Mycobacterium tuberculosis)
BDBM50381136
(CHEMBL2017737)
Show SMILES CN1CCC(CNc2cc(Nc3cc(n[nH]3)C3CC3)nc(n2)-c2cccc(c2)S(C)(=O)=O)CC1
Show InChI InChI=1S/C24H31N7O2S/c1-31-10-8-16(9-11-31)15-25-21-14-22(26-23-13-20(29-30-23)17-6-7-17)28-24(27-21)18-4-3-5-19(12-18)34(2,32)33/h3-5,12-14,16-17H,6-11,15H2,1-2H3,(H3,25,26,27,28,29,30)
n/an/a 40n/an/an/an/an/an/a
MRC Technology
Curated by ChEMBL
Assay Description
Inhibition of Mycobacterium tuberculosis GST-fused PknB expressed in Escherichia coli assessed as GarA substrate phosphorylation after 30 mins
Bioorg Med Chem Lett 22: 3349-53 (2012)
Article DOI: 10.1016/j.bmcl.2012.02.107
BindingDB Entry DOI: 10.7270/Q22Z16JX