BDBM50381256 CHEMBL2018673
SMILES: COc1ccc(Cc2nn(Cc3n[nH]c(=S)n3C)c(=O)c3c(C)noc23)cc1
InChI Key: InChIKey=IFYXHUCCIJQGBH-UHFFFAOYSA-N
Data: 2 IC50
Activity Spreadsheet -- Enzyme Inhibition Constant Data from BindingDB
Found 2 hits for monomerid = 50381256
Trg + Lig
Ki
nM
ΔG°
kcal/mole
IC50
nM
Kd
nM
EC50/IC50
nM
koff
s-1
kon
M-1s-1
pHTemp
°C
Prostaglandin G/H synthase 2
(Homo sapiens (Human))
BDBM50381256
(CHEMBL2018673)
Show SMILES COc1ccc(Cc2nn(Cc3n[nH]c(=S)n3C)c(=O)c3c(C)noc23)cc1
Show InChI InChI=1S/C18H18N6O3S/c1-10-15-16(27-22-10)13(8-11-4-6-12(26-3)7-5-11)21-24(17(15)25)9-14-19-20-18(28)23(14)2/h4-7H,8-9H2,1-3H3,(H,20,28)
NCI pathway
Reactome pathway
n/an/a 2.10E+3n/an/an/an/an/an/a
University of Hacettepe
Curated by ChEMBL
Assay Description
Inhibition of human recombinant COX2 by fluorescence assay
Bioorg Med Chem 20: 2912-22 (2012)
Article DOI: 10.1016/j.bmc.2012.03.021
BindingDB Entry DOI: 10.7270/Q2F76DKX
Prostaglandin G/H synthase 1
(Ovis aries (Sheep))
BDBM50381256
(CHEMBL2018673)
Show SMILES COc1ccc(Cc2nn(Cc3n[nH]c(=S)n3C)c(=O)c3c(C)noc23)cc1
Show InChI InChI=1S/C18H18N6O3S/c1-10-15-16(27-22-10)13(8-11-4-6-12(26-3)7-5-11)21-24(17(15)25)9-14-19-20-18(28)23(14)2/h4-7H,8-9H2,1-3H3,(H,20,28)
n/an/a 2.65E+4n/an/an/an/an/an/a
University of Hacettepe
Curated by ChEMBL
Assay Description
Inhibition of ovine COX1 by fluorescence assay
Bioorg Med Chem 20: 2912-22 (2012)
Article DOI: 10.1016/j.bmc.2012.03.021
BindingDB Entry DOI: 10.7270/Q2F76DKX