BDBM50381268 CHEMBL2018870
SMILES: COc1ccc(cc1)S(=O)(=O)N1C(CC(=O)NCCc2ccc(cc2)C2=NCCN2)c2ccccc2-c2ccccc12
InChI Key: InChIKey=ROVKFWWHHOBTHV-UHFFFAOYSA-N
Data: 1 KI  1 IC50
Activity Spreadsheet -- Enzyme Inhibition Constant Data from BindingDB
Found 2 hits for monomerid = 50381268
Trg + Lig
Ki
nM
ΔG°
kcal/mole
IC50
nM
Kd
nM
EC50/IC50
nM
koff
s-1
kon
M-1s-1
pHTemp
°C
Bradykinin B1 receptor
(Homo sapiens (Human))
BDBM50381268
(CHEMBL2018870)
Show SMILES COc1ccc(cc1)S(=O)(=O)N1C(CC(=O)NCCc2ccc(cc2)C2=NCCN2)c2ccccc2-c2ccccc12 |t:27|
Show InChI InChI=1S/C33H32N4O4S/c1-41-25-14-16-26(17-15-25)42(39,40)37-30-9-5-4-7-28(30)27-6-2-3-8-29(27)31(37)22-32(38)34-19-18-23-10-12-24(13-11-23)33-35-20-21-36-33/h2-17,31H,18-22H2,1H3,(H,34,38)(H,35,36)
15.5n/an/an/an/an/an/an/an/a
Gedeon Richter Plc.
Curated by ChEMBL
Assay Description
Binding affinity to human bradykinin B1 receptor
Bioorg Med Chem Lett 22: 3095-9 (2012)
Article DOI: 10.1016/j.bmcl.2012.03.065
BindingDB Entry DOI: 10.7270/Q21Z45F0
BDKRB1
(RAT)
BDBM50381268
(CHEMBL2018870)
Show SMILES COc1ccc(cc1)S(=O)(=O)N1C(CC(=O)NCCc2ccc(cc2)C2=NCCN2)c2ccccc2-c2ccccc12 |t:27|
Show InChI InChI=1S/C33H32N4O4S/c1-41-25-14-16-26(17-15-25)42(39,40)37-30-9-5-4-7-28(30)27-6-2-3-8-29(27)31(37)22-32(38)34-19-18-23-10-12-24(13-11-23)33-35-20-21-36-33/h2-17,31H,18-22H2,1H3,(H,34,38)(H,35,36)
Reactome pathway
n/an/a 81n/an/an/an/an/an/a
Gedeon Richter Plc.
Curated by ChEMBL
Assay Description
Antagonist activity at rat bradykinin B1 receptor
Bioorg Med Chem Lett 22: 3095-9 (2012)
Article DOI: 10.1016/j.bmcl.2012.03.065
BindingDB Entry DOI: 10.7270/Q21Z45F0