BDBM50381903 CHEMBL2022908
SMILES: CCc1cc(CN2CC(C2)C(O)=O)sc1-c1ncc(s1)-c1ccc(OC(C)C)c(Cl)c1
InChI Key: InChIKey=BLMAVCYCFPRDFN-UHFFFAOYSA-N
Data: 2 EC50
Activity Spreadsheet -- Enzyme Inhibition Constant Data from BindingDB
Found 2 hits for monomerid = 50381903
Trg + Lig
Ki
nM
ΔG°
kcal/mole
IC50
nM
Kd
nM
EC50/IC50
nM
koff
s-1
kon
M-1s-1
pHTemp
°C
Sphingosine 1-phosphate receptor 3
(Homo sapiens (Human))
BDBM50381903
(CHEMBL2022908)
Show SMILES CCc1cc(CN2CC(C2)C(O)=O)sc1-c1ncc(s1)-c1ccc(OC(C)C)c(Cl)c1
Show InChI InChI=1S/C23H25ClN2O3S2/c1-4-14-7-17(12-26-10-16(11-26)23(27)28)30-21(14)22-25-9-20(31-22)15-5-6-19(18(24)8-15)29-13(2)3/h5-9,13,16H,4,10-12H2,1-3H3,(H,27,28)
NCI pathway
Reactome pathway
n/an/an/an/a>2.00E+4n/an/an/an/a
Daiichi Sankyo Co., Ltd
Curated by ChEMBL
Assay Description
Agonist activity at human S1P3 receptor by [S35]GTPgammaS binding assay
Bioorg Med Chem Lett 22: 3083-8 (2012)
Article DOI: 10.1016/j.bmcl.2012.03.067
BindingDB Entry DOI: 10.7270/Q2JS9RG9
Sphingosine 1-phosphate receptor 1
(Homo sapiens (Human))
BDBM50381903
(CHEMBL2022908)
Show SMILES CCc1cc(CN2CC(C2)C(O)=O)sc1-c1ncc(s1)-c1ccc(OC(C)C)c(Cl)c1
Show InChI InChI=1S/C23H25ClN2O3S2/c1-4-14-7-17(12-26-10-16(11-26)23(27)28)30-21(14)22-25-9-20(31-22)15-5-6-19(18(24)8-15)29-13(2)3/h5-9,13,16H,4,10-12H2,1-3H3,(H,27,28)
Reactome pathway
n/an/an/an/a 3.20n/an/an/an/a
Daiichi Sankyo Co., Ltd
Curated by ChEMBL
Assay Description
Agonist activity at human S1P1 receptor by [S35]GTPgammaS binding assay
Bioorg Med Chem Lett 22: 3083-8 (2012)
Article DOI: 10.1016/j.bmcl.2012.03.067
BindingDB Entry DOI: 10.7270/Q2JS9RG9