BDBM50381909 CHEMBL2022708
SMILES: CCc1cc(CN2CC(C2)C(O)=O)sc1-c1ncc(o1)-c1ccc(Oc2ccccc2)cc1
InChI Key: InChIKey=NPCGGJANGPAUKS-UHFFFAOYSA-N
Data: 2 EC50
Activity Spreadsheet -- Enzyme Inhibition Constant Data from BindingDB
Found 2 hits for monomerid = 50381909
Trg + Lig
Ki
nM
ΔG°
kcal/mole
IC50
nM
Kd
nM
EC50/IC50
nM
koff
s-1
kon
M-1s-1
pHTemp
°C
Sphingosine 1-phosphate receptor 3
(Homo sapiens (Human))
BDBM50381909
(CHEMBL2022708)
Show SMILES CCc1cc(CN2CC(C2)C(O)=O)sc1-c1ncc(o1)-c1ccc(Oc2ccccc2)cc1
Show InChI InChI=1S/C26H24N2O4S/c1-2-17-12-22(16-28-14-19(15-28)26(29)30)33-24(17)25-27-13-23(32-25)18-8-10-21(11-9-18)31-20-6-4-3-5-7-20/h3-13,19H,2,14-16H2,1H3,(H,29,30)
NCI pathway
Reactome pathway
n/an/an/an/a>2.00E+4n/an/an/an/a
Daiichi Sankyo Co., Ltd
Curated by ChEMBL
Assay Description
Agonist activity at human S1P3 receptor by [S35]GTPgammaS binding assay
Bioorg Med Chem Lett 22: 3083-8 (2012)
Article DOI: 10.1016/j.bmcl.2012.03.067
BindingDB Entry DOI: 10.7270/Q2JS9RG9
Sphingosine 1-phosphate receptor 1
(Homo sapiens (Human))
BDBM50381909
(CHEMBL2022708)
Show SMILES CCc1cc(CN2CC(C2)C(O)=O)sc1-c1ncc(o1)-c1ccc(Oc2ccccc2)cc1
Show InChI InChI=1S/C26H24N2O4S/c1-2-17-12-22(16-28-14-19(15-28)26(29)30)33-24(17)25-27-13-23(32-25)18-8-10-21(11-9-18)31-20-6-4-3-5-7-20/h3-13,19H,2,14-16H2,1H3,(H,29,30)
Reactome pathway
n/an/an/an/a 90n/an/an/an/a
Daiichi Sankyo Co., Ltd
Curated by ChEMBL
Assay Description
Agonist activity at human S1P1 receptor by [S35]GTPgammaS binding assay
Bioorg Med Chem Lett 22: 3083-8 (2012)
Article DOI: 10.1016/j.bmcl.2012.03.067
BindingDB Entry DOI: 10.7270/Q2JS9RG9