BDBM50381990 CHEMBL2022113
SMILES: CC1CCCN(Cc2cc(Nc3nc(C)cn4c(cnc34)-c3cnn(CC(O)=O)c3)sn2)C1
InChI Key: InChIKey=VDBPPXVERWJWQR-UHFFFAOYSA-N
Data: 2 IC50
Activity Spreadsheet -- Enzyme Inhibition Constant Data from BindingDB
Found 2 hits for monomerid = 50381990
Trg + Lig
Ki
nM
ΔG°
kcal/mole
IC50
nM
Kd
nM
EC50/IC50
nM
koff
s-1
kon
M-1s-1
pHTemp
°C
Aurora kinase A
(Homo sapiens (Human))
BDBM50381990
(CHEMBL2022113)
Show SMILES CC1CCCN(Cc2cc(Nc3nc(C)cn4c(cnc34)-c3cnn(CC(O)=O)c3)sn2)C1
Show InChI InChI=1S/C22H26N8O2S/c1-14-4-3-5-28(9-14)12-17-6-19(33-27-17)26-21-22-23-8-18(30(22)10-15(2)25-21)16-7-24-29(11-16)13-20(31)32/h6-8,10-11,14H,3-5,9,12-13H2,1-2H3,(H,25,26)(H,31,32)
NCI pathway
Reactome pathway
n/an/a 836n/an/an/an/an/an/a
AMRI
Curated by ChEMBL
Assay Description
Inhibition of aurora A kinase using 5TAMRA-GRTGRRNSICOOH as substrate by fluorescent assay
Bioorg Med Chem Lett 22: 3544-9 (2012)
Article DOI: 10.1016/j.bmcl.2012.03.051
BindingDB Entry DOI: 10.7270/Q2X34ZGD
Aurora kinase B
(Homo sapiens (Human))
BDBM50381990
(CHEMBL2022113)
Show SMILES CC1CCCN(Cc2cc(Nc3nc(C)cn4c(cnc34)-c3cnn(CC(O)=O)c3)sn2)C1
Show InChI InChI=1S/C22H26N8O2S/c1-14-4-3-5-28(9-14)12-17-6-19(33-27-17)26-21-22-23-8-18(30(22)10-15(2)25-21)16-7-24-29(11-16)13-20(31)32/h6-8,10-11,14H,3-5,9,12-13H2,1-2H3,(H,25,26)(H,31,32)
Reactome pathway
n/an/a 146n/an/an/an/an/an/a
AMRI
Curated by ChEMBL
Assay Description
Inhibition of aurora B kinase using 5TAMRA-GRTGRRNSICOOH as substrate by fluorescent assay
Bioorg Med Chem Lett 22: 3544-9 (2012)
Article DOI: 10.1016/j.bmcl.2012.03.051
BindingDB Entry DOI: 10.7270/Q2X34ZGD