BDBM50382164 CHEMBL2023828
SMILES: C1CN(CCO1)c1ccc(cc1)C(c1ccccc1)C12CC3CC(CC(C3)C1)C2
InChI Key: InChIKey=KBPHQNDPEWHCHW-UHFFFAOYSA-N
Data: 1 IC50
Activity Spreadsheet -- Enzyme Inhibition Constant Data from BindingDB
Found 1 hit for monomerid = 50382164
Trg + Lig
Ki
nM
ΔG°
kcal/mole
IC50
nM
Kd
nM
EC50/IC50
nM
koff
s-1
kon
M-1s-1
pHTemp
°C
Sigma non-opioid intracellular receptor 1
(Homo sapiens (Human))
BDBM50382164
(CHEMBL2023828)
Show SMILES C1CN(CCO1)c1ccc(cc1)C(c1ccccc1)C12CC3CC(CC(C3)C1)C2 |TLB:12:19:22.21.26:24,THB:20:21:24:28.19.27,20:19:22.21.26:24,27:19:22:26.25.24,27:25:22:28.20.19,12:19:22:26.25.24|
Show InChI InChI=1S/C27H33NO/c1-2-4-23(5-3-1)26(27-17-20-14-21(18-27)16-22(15-20)19-27)24-6-8-25(9-7-24)28-10-12-29-13-11-28/h1-9,20-22,26H,10-19H2
n/an/a>100n/an/an/an/an/an/a
National and Kapodistrian University of Athens
Curated by ChEMBL
Assay Description
Displacement of [3H](+)pentazocine from sigma-1 receptor expressed in human Jurkat cell membranes after 2 hrs by liquid scintillation spectroscopy
Bioorg Med Chem 20: 3323-31 (2012)
Article DOI: 10.1016/j.bmc.2012.03.038
BindingDB Entry DOI: 10.7270/Q20V8DT0