BDBM50382187 CHEMBL2023853
SMILES: Fc1ccc(cc1)-c1csc(Nc2ccc(Oc3ccccc3)cc2)n1
InChI Key: InChIKey=STKTYKKUOJJZPR-UHFFFAOYSA-N
Data: 1 IC50
Activity Spreadsheet -- Enzyme Inhibition Constant Data from BindingDB
Found 1 hit for monomerid = 50382187
Trg + Lig
Ki
nM
ΔG°
kcal/mole
IC50
nM
Kd
nM
EC50/IC50
nM
koff
s-1
kon
M-1s-1
pHTemp
°C
Cyclooxygenase
(Homo sapiens (Human))
BDBM50382187
(CHEMBL2023853)
Show SMILES Fc1ccc(cc1)-c1csc(Nc2ccc(Oc3ccccc3)cc2)n1
Show InChI InChI=1S/C21H15FN2OS/c22-16-8-6-15(7-9-16)20-14-26-21(24-20)23-17-10-12-19(13-11-17)25-18-4-2-1-3-5-18/h1-14H,(H,23,24)
NCI pathway
Reactome pathway
n/an/a>5.00E+3n/an/an/an/an/an/a
The University of Arizona
Curated by ChEMBL
Assay Description
Inhibition of COX2 by fluorescence assay
Bioorg Med Chem Lett 22: 3567-70 (2012)
Article DOI: 10.1016/j.bmcl.2012.03.013
BindingDB Entry DOI: 10.7270/Q2RB75MP