BDBM50382338 CHEMBL2024344
SMILES: CC(C)(COP(O)(=O)OP(O)(=O)OC[C@H]1O[C@H]([C@H](O)[C@@H]1OP(O)(O)=O)n1cnc2c(N)ncnc12)[C@@H](O)C(=O)NCCC(=O)NCCSC(CC(=O)c1ccc(Cl)cc1Cl)C(O)=O
InChI Key: InChIKey=PWJRHDWZFQSMEK-DVXAHSAASA-N
Data: 2 KI  1 IC50
Activity Spreadsheet -- Enzyme Inhibition Constant Data from BindingDB
Found 3 hits for monomerid = 50382338
Trg + Lig
Ki
nM
ΔG°
kcal/mole
IC50
nM
Kd
nM
EC50/IC50
nM
koff
s-1
kon
M-1s-1
pHTemp
°C
1,4-Dihydroxy-2-naphthoyl-CoA synthase
(Mycobacterium tuberculosis)
BDBM50382338
(CHEMBL2024344)
Show SMILES CC(C)(COP(O)(=O)OP(O)(=O)OC[C@H]1O[C@H]([C@H](O)[C@@H]1OP(O)(O)=O)n1cnc2c(N)ncnc12)[C@@H](O)C(=O)NCCC(=O)NCCSC(CC(=O)c1ccc(Cl)cc1Cl)C(O)=O |r|
Show InChI InChI=1S/C31H42Cl2N7O19P3S/c1-31(2,25(44)28(45)36-6-5-21(42)35-7-8-63-20(30(46)47)10-18(41)16-4-3-15(32)9-17(16)33)12-56-62(53,54)59-61(51,52)55-11-19-24(58-60(48,49)50)23(43)29(57-19)40-14-39-22-26(34)37-13-38-27(22)40/h3-4,9,13-14,19-20,23-25,29,43-44H,5-8,10-12H2,1-2H3,(H,35,42)(H,36,45)(H,46,47)(H,51,52)(H,53,54)(H2,34,37,38)(H2,48,49,50)/t19-,20?,23-,24-,25+,29-/m1/s1
49n/an/an/an/an/an/an/an/a
TBA
Curated by ChEMBL
Assay Description
Inhibition of Mycobacterium tuberculosis MenB expressed in Escherichia coli BL21 (DE3) by Lineweaver-Burk plot analysis
ACS Med Chem Lett 2: 818-823 (2011)
Article DOI: 10.1021/ml200141e
BindingDB Entry DOI: 10.7270/Q2B56KRM
1,4-Dihydroxy-2-naphthoyl-CoA synthase
(Mycobacterium tuberculosis)
BDBM50382338
(CHEMBL2024344)
Show SMILES CC(C)(COP(O)(=O)OP(O)(=O)OC[C@H]1O[C@H]([C@H](O)[C@@H]1OP(O)(O)=O)n1cnc2c(N)ncnc12)[C@@H](O)C(=O)NCCC(=O)NCCSC(CC(=O)c1ccc(Cl)cc1Cl)C(O)=O |r|
Show InChI InChI=1S/C31H42Cl2N7O19P3S/c1-31(2,25(44)28(45)36-6-5-21(42)35-7-8-63-20(30(46)47)10-18(41)16-4-3-15(32)9-17(16)33)12-56-62(53,54)59-61(51,52)55-11-19-24(58-60(48,49)50)23(43)29(57-19)40-14-39-22-26(34)37-13-38-27(22)40/h3-4,9,13-14,19-20,23-25,29,43-44H,5-8,10-12H2,1-2H3,(H,35,42)(H,36,45)(H,46,47)(H,51,52)(H,53,54)(H2,34,37,38)(H2,48,49,50)/t19-,20?,23-,24-,25+,29-/m1/s1
286n/an/an/an/an/an/an/an/a
TBA
Curated by ChEMBL
Assay Description
Non-competitive inhibition of Mycobacterium tuberculosis MenB expressed in Escherichia coli BL21 (DE3) by Lineweaver-Burk plot analysis
ACS Med Chem Lett 2: 818-823 (2011)
Article DOI: 10.1021/ml200141e
BindingDB Entry DOI: 10.7270/Q2B56KRM
1,4-Dihydroxy-2-naphthoyl-CoA synthase
(Mycobacterium tuberculosis)
BDBM50382338
(CHEMBL2024344)
Show SMILES CC(C)(COP(O)(=O)OP(O)(=O)OC[C@H]1O[C@H]([C@H](O)[C@@H]1OP(O)(O)=O)n1cnc2c(N)ncnc12)[C@@H](O)C(=O)NCCC(=O)NCCSC(CC(=O)c1ccc(Cl)cc1Cl)C(O)=O |r|
Show InChI InChI=1S/C31H42Cl2N7O19P3S/c1-31(2,25(44)28(45)36-6-5-21(42)35-7-8-63-20(30(46)47)10-18(41)16-4-3-15(32)9-17(16)33)12-56-62(53,54)59-61(51,52)55-11-19-24(58-60(48,49)50)23(43)29(57-19)40-14-39-22-26(34)37-13-38-27(22)40/h3-4,9,13-14,19-20,23-25,29,43-44H,5-8,10-12H2,1-2H3,(H,35,42)(H,36,45)(H,46,47)(H,51,52)(H,53,54)(H2,34,37,38)(H2,48,49,50)/t19-,20?,23-,24-,25+,29-/m1/s1
n/an/a 106n/an/an/an/an/an/a
TBA
Curated by ChEMBL
Assay Description
Inhibition of Mycobacterium tuberculosis MenB expressed in Escherichia coli BL21 (DE3) assessed as formation of DHNA-CoA from OSB-CoA by enzyme coupl...
ACS Med Chem Lett 2: 818-823 (2011)
Article DOI: 10.1021/ml200141e
BindingDB Entry DOI: 10.7270/Q2B56KRM