BDBM50382610 CHEMBL2022413
SMILES: OCC\N=c1/nc(-c2ccccc2)n(s1)-c1cccc2ccccc12
InChI Key: InChIKey=PDBIVMSLLHVXJJ-QZQOTICOSA-N
Data: 1 IC50
Activity Spreadsheet -- Enzyme Inhibition Constant Data from BindingDB
Found 1 hit for monomerid = 50382610
Trg + Lig
Ki
nM
ΔG°
kcal/mole
IC50
nM
Kd
nM
EC50/IC50
nM
koff
s-1
kon
M-1s-1
pHTemp
°C
Glycogen synthase kinase-3 beta
(Homo sapiens (Human))
BDBM50382610
(CHEMBL2022413)
Show SMILES OCC\N=c1/nc(-c2ccccc2)n(s1)-c1cccc2ccccc12
Show InChI InChI=1S/C20H17N3OS/c24-14-13-21-20-22-19(16-8-2-1-3-9-16)23(25-20)18-12-6-10-15-7-4-5-11-17(15)18/h1-12,24H,13-14H2/b21-20+
NCI pathway
Reactome pathway
n/an/a 300n/an/an/an/an/an/a
Instituto de Qu£mica M£dica-CSIC
Curated by ChEMBL
Assay Description
Inhibition of human recombinant GSK3beta after 30 mins by luminescence assay in presence of ATP
J Med Chem 55: 1645-61 (2012)
Article DOI: 10.1021/jm201463v
BindingDB Entry DOI: 10.7270/Q2862HGD