BDBM50382659 CHEMBL2023990
SMILES: COc1cc(Nc2nccc(n2)N2CCC[C@@H](C2)C(=O)NCc2ccc(OC(F)(F)F)cc2)cc(OC)c1OC
InChI Key: InChIKey=GBYYHFNOPGCXMC-SFHVURJKSA-N
Data: 2 IC50
Activity Spreadsheet -- Enzyme Inhibition Constant Data from BindingDB
Found 2 hits for monomerid = 50382659
Trg + Lig
Ki
nM
ΔG°
kcal/mole
IC50
nM
Kd
nM
EC50/IC50
nM
koff
s-1
kon
M-1s-1
pHTemp
°C
ALK tyrosine kinase receptor
(Homo sapiens (Human))
BDBM50382659
(CHEMBL2023990)
Show SMILES COc1cc(Nc2nccc(n2)N2CCC[C@@H](C2)C(=O)NCc2ccc(OC(F)(F)F)cc2)cc(OC)c1OC |r|
Show InChI InChI=1S/C27H30F3N5O5/c1-37-21-13-19(14-22(38-2)24(21)39-3)33-26-31-11-10-23(34-26)35-12-4-5-18(16-35)25(36)32-15-17-6-8-20(9-7-17)40-27(28,29)30/h6-11,13-14,18H,4-5,12,15-16H2,1-3H3,(H,32,36)(H,31,33,34)/t18-/m0/s1
n/an/a 10n/an/an/an/an/an/a
Amgen Inc.
Curated by ChEMBL
Assay Description
Inhibition of human N-terminal GST-fused ALK cytoplasmic domain (1058 to 1620) expressed in SF9 cells using Biotin-Ahx- EQEDEPEGIYGVLF-OH as substrat...
J Med Chem 55: 1698-705 (2012)
Article DOI: 10.1021/jm201565s
BindingDB Entry DOI: 10.7270/Q20P111R
Insulin-like growth factor 1 receptor
(Homo sapiens (Human))
BDBM50382659
(CHEMBL2023990)
Show SMILES COc1cc(Nc2nccc(n2)N2CCC[C@@H](C2)C(=O)NCc2ccc(OC(F)(F)F)cc2)cc(OC)c1OC |r|
Show InChI InChI=1S/C27H30F3N5O5/c1-37-21-13-19(14-22(38-2)24(21)39-3)33-26-31-11-10-23(34-26)35-12-4-5-18(16-35)25(36)32-15-17-6-8-20(9-7-17)40-27(28,29)30/h6-11,13-14,18H,4-5,12,15-16H2,1-3H3,(H,32,36)(H,31,33,34)/t18-/m0/s1
Reactome pathway
n/an/a 798n/an/an/an/an/an/a
Amgen Inc.
Curated by ChEMBL
Assay Description
Inhibition of human N-terminal GST-fused IGF1R cytoplasmic domain (960 to 1367) expressed in Hi5 cells using Biotin- Ahx- EEEEAYGWLDF-OH as substrate...
J Med Chem 55: 1698-705 (2012)
Article DOI: 10.1021/jm201565s
BindingDB Entry DOI: 10.7270/Q20P111R