BDBM50382688 CHEMBL2023155::US9409868, 19
SMILES: O=C(NCCCc1ccccc1)Nc1ccc2[nH]ncc2c1
InChI Key: InChIKey=WNUHXXHPBJTMSD-UHFFFAOYSA-N
Data: 4 IC50
Activity Spreadsheet -- Enzyme Inhibition Constant Data from BindingDB
Found 4 hits for monomerid = 50382688
Trg + Lig
Ki
nM
ΔG°
kcal/mole
IC50
nM
Kd
nM
EC50/IC50
nM
koff
s-1
kon
M-1s-1
pHTemp
°C
Rho-associated protein kinase 1 (ROCK1)
(Homo sapiens (Human))
BDBM50382688
(CHEMBL2023155 | US9409868, 19)
Show SMILES O=C(NCCCc1ccccc1)Nc1ccc2[nH]ncc2c1
Show InChI InChI=1S/C17H18N4O/c22-17(18-10-4-7-13-5-2-1-3-6-13)20-15-8-9-16-14(11-15)12-19-21-16/h1-3,5-6,8-9,11-12H,4,7,10H2,(H,19,21)(H2,18,20,22)
US Patent
n/an/a 2.46E+3n/an/an/an/a7.525
H. Lee Moffin Cancer Center and Research Institute, Inc.
US Patent
Assay Description
A robust FRET-based, enzyme-coupled assay format, Z-Lyte® Kinase Assay Ser/Thr 13 Peptide Kit (Invitrogen, cat. PV3793), was employed in this stu...
US Patent US9409868 (2016)
BindingDB Entry DOI: 10.7270/Q2X63KT0
Rho-associated protein kinase 1
(Homo sapiens (Human))
BDBM50382688
(CHEMBL2023155 | US9409868, 19)
Show SMILES O=C(NCCCc1ccccc1)Nc1ccc2[nH]ncc2c1
Show InChI InChI=1S/C17H18N4O/c22-17(18-10-4-7-13-5-2-1-3-6-13)20-15-8-9-16-14(11-15)12-19-21-16/h1-3,5-6,8-9,11-12H,4,7,10H2,(H,19,21)(H2,18,20,22)
NCI pathway
Reactome pathway
n/an/a 2.46E+3n/an/an/an/an/an/a
H. Lee Moffitt Cancer Center and Research Institute
Curated by ChEMBL
Assay Description
Inhibition of human His-puritin-tagged ROCK1 expressed in Sf9 cells after 1 hr by FRET-based enzyme-coupled assay
J Med Chem 55: 2474-8 (2012)
Article DOI: 10.1021/jm201289r
BindingDB Entry DOI: 10.7270/Q2MG7QH3
Rho-associated protein kinase 2
(Homo sapiens (Human))
BDBM50382688
(CHEMBL2023155 | US9409868, 19)
Show SMILES O=C(NCCCc1ccccc1)Nc1ccc2[nH]ncc2c1
Show InChI InChI=1S/C17H18N4O/c22-17(18-10-4-7-13-5-2-1-3-6-13)20-15-8-9-16-14(11-15)12-19-21-16/h1-3,5-6,8-9,11-12H,4,7,10H2,(H,19,21)(H2,18,20,22)
n/an/a 1.07E+3n/an/an/an/an/an/a
H. Lee Moffitt Cancer Center and Research Institute
Curated by ChEMBL
Assay Description
Inhibition of ROCK2 after 1 hr by FRET-based enzyme-coupled assay
J Med Chem 55: 2474-8 (2012)
Article DOI: 10.1021/jm201289r
BindingDB Entry DOI: 10.7270/Q2MG7QH3
Rho-associated protein kinase 2 (ROCK2)
(Homo sapiens (Human))
BDBM50382688
(CHEMBL2023155 | US9409868, 19)
Show SMILES O=C(NCCCc1ccccc1)Nc1ccc2[nH]ncc2c1
Show InChI InChI=1S/C17H18N4O/c22-17(18-10-4-7-13-5-2-1-3-6-13)20-15-8-9-16-14(11-15)12-19-21-16/h1-3,5-6,8-9,11-12H,4,7,10H2,(H,19,21)(H2,18,20,22)
US Patent
n/an/a 1.07E+3n/an/an/an/a7.525
H. Lee Moffin Cancer Center and Research Institute, Inc.
US Patent
Assay Description
A robust FRET-based, enzyme-coupled assay format, Z-Lyte® Kinase Assay Ser/Thr 13 Peptide Kit (Invitrogen, cat. PV3793), was employed in this stu...
US Patent US9409868 (2016)
BindingDB Entry DOI: 10.7270/Q2X63KT0