BDBM50382939 CHEMBL2029568
SMILES: O[C@]1(CC[C@@H](CC1)N[C@H]1CCN(C1)C(=O)C1CCN(CC1)c1cc(ccn1)C(F)(F)F)c1ccc(cn1)-c1ncccn1
InChI Key: InChIKey=CELIKIDZYOXJMB-QRQMUESOSA-N
Data: 4 IC50
Activity Spreadsheet -- Enzyme Inhibition Constant Data from BindingDB
Found 4 hits for monomerid = 50382939
Trg + Lig
Ki
nM
ΔG°
kcal/mole
IC50
nM
Kd
nM
EC50/IC50
nM
koff
s-1
kon
M-1s-1
pHTemp
°C
Potassium voltage-gated channel subfamily H member 2
(Homo sapiens (Human))
BDBM50382939
(CHEMBL2029568)
Show SMILES O[C@]1(CC[C@@H](CC1)N[C@H]1CCN(C1)C(=O)C1CCN(CC1)c1cc(ccn1)C(F)(F)F)c1ccc(cn1)-c1ncccn1 |r,wU:4.7,wD:1.0,8.8,(-3.38,-21.11,;-2.05,-21.88,;-.72,-22.64,;.61,-21.88,;.61,-20.34,;-.72,-19.56,;-2.05,-20.34,;1.95,-19.57,;3.28,-20.35,;3.3,-21.88,;4.77,-22.34,;5.66,-21.08,;4.74,-19.85,;6.99,-20.3,;6.98,-18.76,;8.33,-21.06,;8.33,-22.6,;9.66,-23.36,;10.99,-22.58,;10.99,-21.04,;9.65,-20.27,;12.33,-23.35,;13.65,-22.57,;14.99,-23.33,;15,-24.87,;13.66,-25.65,;12.33,-24.88,;16.31,-22.55,;17.65,-23.31,;16.3,-21.01,;17.64,-21.76,;-3.38,-22.65,;-4.71,-21.88,;-6.04,-22.65,;-6.04,-24.19,;-4.7,-24.96,;-3.37,-24.19,;-7.37,-24.97,;-8.71,-24.21,;-10.04,-24.98,;-10.03,-26.52,;-8.69,-27.29,;-7.36,-26.51,)|
Show InChI InChI=1S/C31H36F3N7O2/c32-31(33,34)23-6-14-35-27(18-23)40-15-7-21(8-16-40)29(42)41-17-9-25(20-41)39-24-4-10-30(43,11-5-24)26-3-2-22(19-38-26)28-36-12-1-13-37-28/h1-3,6,12-14,18-19,21,24-25,39,43H,4-5,7-11,15-17,20H2/t24-,25-,30-/m0/s1
Reactome pathway
n/an/a 2.80E+4n/an/an/an/an/an/a
TBA
Curated by ChEMBL
Assay Description
Displacement of [3H]dofetilide from human ERG
ACS Med Chem Lett 2: 913-918 (2011)
Article DOI: 10.1021/ml200199c
BindingDB Entry DOI: 10.7270/Q29024TK
C-C chemokine receptor type 2
(Homo sapiens (Human))
BDBM50382939
(CHEMBL2029568)
Show SMILES O[C@]1(CC[C@@H](CC1)N[C@H]1CCN(C1)C(=O)C1CCN(CC1)c1cc(ccn1)C(F)(F)F)c1ccc(cn1)-c1ncccn1 |r,wU:4.7,wD:1.0,8.8,(-3.38,-21.11,;-2.05,-21.88,;-.72,-22.64,;.61,-21.88,;.61,-20.34,;-.72,-19.56,;-2.05,-20.34,;1.95,-19.57,;3.28,-20.35,;3.3,-21.88,;4.77,-22.34,;5.66,-21.08,;4.74,-19.85,;6.99,-20.3,;6.98,-18.76,;8.33,-21.06,;8.33,-22.6,;9.66,-23.36,;10.99,-22.58,;10.99,-21.04,;9.65,-20.27,;12.33,-23.35,;13.65,-22.57,;14.99,-23.33,;15,-24.87,;13.66,-25.65,;12.33,-24.88,;16.31,-22.55,;17.65,-23.31,;16.3,-21.01,;17.64,-21.76,;-3.38,-22.65,;-4.71,-21.88,;-6.04,-22.65,;-6.04,-24.19,;-4.7,-24.96,;-3.37,-24.19,;-7.37,-24.97,;-8.71,-24.21,;-10.04,-24.98,;-10.03,-26.52,;-8.69,-27.29,;-7.36,-26.51,)|
Show InChI InChI=1S/C31H36F3N7O2/c32-31(33,34)23-6-14-35-27(18-23)40-15-7-21(8-16-40)29(42)41-17-9-25(20-41)39-24-4-10-30(43,11-5-24)26-3-2-22(19-38-26)28-36-12-1-13-37-28/h1-3,6,12-14,18-19,21,24-25,39,43H,4-5,7-11,15-17,20H2/t24-,25-,30-/m0/s1
n/an/a 3.30n/an/an/an/an/an/a
TBA
Curated by ChEMBL
Assay Description
Displacement of [125I]MCP1 from human CCR2 in PBMC after 30 mins by gamma counting
ACS Med Chem Lett 2: 913-918 (2011)
Article DOI: 10.1021/ml200199c
BindingDB Entry DOI: 10.7270/Q29024TK
C-C chemokine receptor type 2
(Homo sapiens (Human))
BDBM50382939
(CHEMBL2029568)
Show SMILES O[C@]1(CC[C@@H](CC1)N[C@H]1CCN(C1)C(=O)C1CCN(CC1)c1cc(ccn1)C(F)(F)F)c1ccc(cn1)-c1ncccn1 |r,wU:4.7,wD:1.0,8.8,(-3.38,-21.11,;-2.05,-21.88,;-.72,-22.64,;.61,-21.88,;.61,-20.34,;-.72,-19.56,;-2.05,-20.34,;1.95,-19.57,;3.28,-20.35,;3.3,-21.88,;4.77,-22.34,;5.66,-21.08,;4.74,-19.85,;6.99,-20.3,;6.98,-18.76,;8.33,-21.06,;8.33,-22.6,;9.66,-23.36,;10.99,-22.58,;10.99,-21.04,;9.65,-20.27,;12.33,-23.35,;13.65,-22.57,;14.99,-23.33,;15,-24.87,;13.66,-25.65,;12.33,-24.88,;16.31,-22.55,;17.65,-23.31,;16.3,-21.01,;17.64,-21.76,;-3.38,-22.65,;-4.71,-21.88,;-6.04,-22.65,;-6.04,-24.19,;-4.7,-24.96,;-3.37,-24.19,;-7.37,-24.97,;-8.71,-24.21,;-10.04,-24.98,;-10.03,-26.52,;-8.69,-27.29,;-7.36,-26.51,)|
Show InChI InChI=1S/C31H36F3N7O2/c32-31(33,34)23-6-14-35-27(18-23)40-15-7-21(8-16-40)29(42)41-17-9-25(20-41)39-24-4-10-30(43,11-5-24)26-3-2-22(19-38-26)28-36-12-1-13-37-28/h1-3,6,12-14,18-19,21,24-25,39,43H,4-5,7-11,15-17,20H2/t24-,25-,30-/m0/s1
n/an/a 1.90n/an/an/an/an/an/a
TBA
Curated by ChEMBL
Assay Description
Antagonist activity at CCR2 receptor in human PBMC assessed as inhibition of MCP1-mediated leukocyte chemotaxis after 30 mins by microscopy
ACS Med Chem Lett 2: 913-918 (2011)
Article DOI: 10.1021/ml200199c
BindingDB Entry DOI: 10.7270/Q29024TK
C-C chemokine receptor type 2
(Homo sapiens (Human))
BDBM50382939
(CHEMBL2029568)
Show SMILES O[C@]1(CC[C@@H](CC1)N[C@H]1CCN(C1)C(=O)C1CCN(CC1)c1cc(ccn1)C(F)(F)F)c1ccc(cn1)-c1ncccn1 |r,wU:4.7,wD:1.0,8.8,(-3.38,-21.11,;-2.05,-21.88,;-.72,-22.64,;.61,-21.88,;.61,-20.34,;-.72,-19.56,;-2.05,-20.34,;1.95,-19.57,;3.28,-20.35,;3.3,-21.88,;4.77,-22.34,;5.66,-21.08,;4.74,-19.85,;6.99,-20.3,;6.98,-18.76,;8.33,-21.06,;8.33,-22.6,;9.66,-23.36,;10.99,-22.58,;10.99,-21.04,;9.65,-20.27,;12.33,-23.35,;13.65,-22.57,;14.99,-23.33,;15,-24.87,;13.66,-25.65,;12.33,-24.88,;16.31,-22.55,;17.65,-23.31,;16.3,-21.01,;17.64,-21.76,;-3.38,-22.65,;-4.71,-21.88,;-6.04,-22.65,;-6.04,-24.19,;-4.7,-24.96,;-3.37,-24.19,;-7.37,-24.97,;-8.71,-24.21,;-10.04,-24.98,;-10.03,-26.52,;-8.69,-27.29,;-7.36,-26.51,)|
Show InChI InChI=1S/C31H36F3N7O2/c32-31(33,34)23-6-14-35-27(18-23)40-15-7-21(8-16-40)29(42)41-17-9-25(20-41)39-24-4-10-30(43,11-5-24)26-3-2-22(19-38-26)28-36-12-1-13-37-28/h1-3,6,12-14,18-19,21,24-25,39,43H,4-5,7-11,15-17,20H2/t24-,25-,30-/m0/s1
n/an/a 12n/an/an/an/an/an/a
TBA
Curated by ChEMBL
Assay Description
Antagonist activity at CCR2 receptor in human whole blood assessed as inhibition of alexa-tagged MCP-induced effect 30 mins by flow cytometry
ACS Med Chem Lett 2: 913-918 (2011)
Article DOI: 10.1021/ml200199c
BindingDB Entry DOI: 10.7270/Q29024TK