BDBM50383004 CHEMBL2030707
SMILES: Clc1ccc2n(-c3ccccc3)c3nnc(-c4ccccc4)c(=O)n3c2c1
InChI Key: InChIKey=IKDAEWKBUQVMQD-UHFFFAOYSA-N
Data: 3 KI  1 IC50
Activity Spreadsheet -- Enzyme Inhibition Constant Data from BindingDB
Found 4 hits for monomerid = 50383004
Trg + Lig
Ki
nM
ΔG°
kcal/mole
IC50
nM
Kd
nM
EC50/IC50
nM
koff
s-1
kon
M-1s-1
pHTemp
°C
Adenosine receptor A3
(Homo sapiens (Human))
BDBM50383004
(CHEMBL2030707)
Show SMILES Clc1ccc2n(-c3ccccc3)c3nnc(-c4ccccc4)c(=O)n3c2c1
Show InChI InChI=1S/C21H13ClN4O/c22-15-11-12-17-18(13-15)26-20(27)19(14-7-3-1-4-8-14)23-24-21(26)25(17)16-9-5-2-6-10-16/h1-13H
Reactome pathway
>1.00E+4n/an/an/an/an/an/an/an/a
Universit£ di Pisa
Curated by ChEMBL
Assay Description
Displacement of [125I]AB-MECA from human A3 adenosine receptor expressed in CHO cell membrane
J Med Chem 55: 1490-9 (2012)
Article DOI: 10.1021/jm201177b
BindingDB Entry DOI: 10.7270/Q2CR5VCS
Adenosine receptor A1
(Homo sapiens (Human))
BDBM50383004
(CHEMBL2030707)
Show SMILES Clc1ccc2n(-c3ccccc3)c3nnc(-c4ccccc4)c(=O)n3c2c1
Show InChI InChI=1S/C21H13ClN4O/c22-15-11-12-17-18(13-15)26-20(27)19(14-7-3-1-4-8-14)23-24-21(26)25(17)16-9-5-2-6-10-16/h1-13H
Reactome pathway
>1.00E+4n/an/an/an/an/an/an/an/a
Universit£ di Pisa
Curated by ChEMBL
Assay Description
Displacement of [3H]DPCPX from human A1 adenosine receptor expressed in CHO cell membrane
J Med Chem 55: 1490-9 (2012)
Article DOI: 10.1021/jm201177b
BindingDB Entry DOI: 10.7270/Q2CR5VCS
Adenosine receptor A2a
(Homo sapiens (Human))
BDBM50383004
(CHEMBL2030707)
Show SMILES Clc1ccc2n(-c3ccccc3)c3nnc(-c4ccccc4)c(=O)n3c2c1
Show InChI InChI=1S/C21H13ClN4O/c22-15-11-12-17-18(13-15)26-20(27)19(14-7-3-1-4-8-14)23-24-21(26)25(17)16-9-5-2-6-10-16/h1-13H
NCI pathway
Reactome pathway
>1.00E+4n/an/an/an/an/an/an/an/a
Universit£ di Pisa
Curated by ChEMBL
Assay Description
Displacement of [3H]NECA from human A2A adenosine receptor expressed in CHO cell membrane
J Med Chem 55: 1490-9 (2012)
Article DOI: 10.1021/jm201177b
BindingDB Entry DOI: 10.7270/Q2CR5VCS
Adenosine receptor A2b
(Homo sapiens (Human))
BDBM50383004
(CHEMBL2030707)
Show SMILES Clc1ccc2n(-c3ccccc3)c3nnc(-c4ccccc4)c(=O)n3c2c1
Show InChI InChI=1S/C21H13ClN4O/c22-15-11-12-17-18(13-15)26-20(27)19(14-7-3-1-4-8-14)23-24-21(26)25(17)16-9-5-2-6-10-16/h1-13H
NCI pathway
Reactome pathway
n/an/a 3.10n/an/an/an/an/an/a
Universit£ di Pisa
Curated by ChEMBL
Assay Description
Antagonist activity at human A2B receptor expressed in CHO cells assessed as inhibition of NECA-mediated cAMP accumulation
J Med Chem 55: 1490-9 (2012)
Article DOI: 10.1021/jm201177b
BindingDB Entry DOI: 10.7270/Q2CR5VCS