null
SMILES: COc1cc(cc(OC)c1OC)C(=O)NC(N)=Nc1ccc(C)c(NC(=O)c2ccc(cc2)-c2ccc(F)cc2)c1
InChI Key: InChIKey=PMXQIKHOHRARGZ-UHFFFAOYSA-N
Activity Spreadsheet -- Enzyme Inhibition Constant Data from BindingDB
Found 1 hit for monomerid = 50383029
Trg + Lig
Ki
nM
ΔG°
kcal/mole
IC50
nM
Kd
nM
EC50/IC50
nM
koff
s-1
kon
M-1s-1
pHTemp
°C
Smoothened homolog
(Homo sapiens (Human))
BDBM50383029
(CHEMBL2031288)
Show SMILES COc1cc(cc(OC)c1OC)C(=O)NC(N)=Nc1ccc(C)c(NC(=O)c2ccc(cc2)-c2ccc(F)cc2)c1 |w:17.18|
Show InChI InChI=1S/C31H29FN4O5/c1-18-5-14-24(34-31(33)36-30(38)22-15-26(39-2)28(41-4)27(16-22)40-3)17-25(18)35-29(37)21-8-6-19(7-9-21)20-10-12-23(32)13-11-20/h5-17H,1-4H3,(H,35,37)(H3,33,34,36,38)
n/an/a 14n/an/an/an/an/an/a
Universit£ degli Studi di Siena
Curated by ChEMBL
Assay Description
Inhibition of Smo-mediated Hh signaling in human Shh-light2 cells by luciferase reporter gene assay
J Med Chem 55: 1559-71 (2012)
Article DOI: 10.1021/jm2013369
BindingDB Entry DOI: 10.7270/Q24B32BR