BDBM50383047 CHEMBL2031298
SMILES: Brc1cccc(Nc2ncnc3ccc(NC(=O)CCN4CCCCC4)cc23)c1
InChI Key: InChIKey=LILZTFBVEZLTID-UHFFFAOYSA-N
Data: 1 IC50
Activity Spreadsheet -- Enzyme Inhibition Constant Data from BindingDB
Found 1 hit for monomerid = 50383047
Trg + Lig
Ki
nM
ΔG°
kcal/mole
IC50
nM
Kd
nM
EC50/IC50
nM
koff
s-1
kon
M-1s-1
pHTemp
°C
Epidermal growth factor receptor
(Homo sapiens (Human))
BDBM50383047
(CHEMBL2031298)
Show SMILES Brc1cccc(Nc2ncnc3ccc(NC(=O)CCN4CCCCC4)cc23)c1
Show InChI InChI=1S/C22H24BrN5O/c23-16-5-4-6-17(13-16)27-22-19-14-18(7-8-20(19)24-15-25-22)26-21(29)9-12-28-10-2-1-3-11-28/h4-8,13-15H,1-3,9-12H2,(H,26,29)(H,24,25,27)
n/an/a 0.270n/an/an/an/an/an/a
Universit£ degli Studi di Parma
Curated by ChEMBL
Assay Description
Inhibition of human recombinant EGFR using Ulight-CAGAGAIETDKEYYTVKD as substrate after 15 mins by time-resolved fluorimetric analysis
J Med Chem 55: 2251-64 (2012)
Article DOI: 10.1021/jm201507x
BindingDB Entry DOI: 10.7270/Q20K29M1