null
SMILES: Cc1cc2-c3cc(C)ccc3NC(c3ccccc3F)n2n1
InChI Key: InChIKey=SNMVDGHFHLFIAV-UHFFFAOYSA-N
Activity Spreadsheet -- Enzyme Inhibition Constant Data from BindingDB
Found 1 hit for monomerid = 50383084
Trg + Lig
Ki
nM
ΔG°
kcal/mole
IC50
nM
Kd
nM
EC50/IC50
nM
koff
s-1
kon
M-1s-1
pHTemp
°C
Kinesin-like protein KIF11
(Homo sapiens (Human))
BDBM50383084
(CHEMBL2031568)
Show SMILES Cc1cc2-c3cc(C)ccc3NC(c3ccccc3F)n2n1
Show InChI InChI=1S/C18H16FN3/c1-11-7-8-16-14(9-11)17-10-12(2)21-22(17)18(20-16)13-5-3-4-6-15(13)19/h3-10,18,20H,1-2H3
Reactome pathway
n/an/a 6.30E+3n/an/an/an/an/an/a
Korea Institute of Science and Technology
Curated by ChEMBL
Assay Description
Inhibition of Eg5 ATPase activity by pyruvate kinase/lactate dehydrogenase-linked assay
J Med Chem 55: 2561-73 (2012)
Article DOI: 10.1021/jm201290v
BindingDB Entry DOI: 10.7270/Q2M909P0